{"text_format":"1","workbook":"xlsx","n_sheets":3,"sheets":["Sheet1","Sheet2","Sheet3"],"not_rendered":{"charts":0,"images":0,"macros":1,"external_links":0,"defined_names":1,"comments":0,"pivot_tables":0},"unopened":[],"bounds":{"document_bytes":16777216,"sheet_cells":100000,"rows_first":2000,"rows_last":500,"rows_between":2000,"halvings":0,"cell_chars":16384,"cell_head_chars":4096},"cells_cut":0,"cells_raw":0,"read":"whole","date_system":"1900"}

{"sheet":"Sheet1","index":0,"n_rows":742,"n_cols":17,"rows_kept":742,"cut":false,"hidden":false,"merged":[]}
["2010 Cmdlet","2013 cmdlet","Lync Server 2010 cmdlet","Lync Server 2013 cmdlet","Description","CSAdministrator","CSArchivingAdministrator","CSHelpDesk","CSLocationAdministrator","CsPersistentChatAdministrator","CSResponseGroupAdministrator","CSServerAdministrator","CSUserAdministrator","CSViewOnlyAdministrator","CSVoiceAdministrator","Validate"]
["Approve-CsDeviceUpdateRule","Approve-CsDeviceUpdateRule",{"$f":"IF(ISTEXT(A2),(HYPERLINK(SUBSTITUTE(HLINK(A2),\".aspx\",\"\")&IF(C$1=2013,\"(v=ocs.15).aspx\",\"(v=ocs.14).aspx\"),A2)),\"\")","v":"Approve-CsDeviceUpdateRule"},{"$f":"IF(ISTEXT(B2),(HYPERLINK(SUBSTITUTE(HLINK(B2),\".aspx\",\"\")&IF(D$1=2013,\"(v=ocs.15).aspx\",\"(v=ocs.14).aspx\"),B2)),\"\")","v":"Approve-CsDeviceUpdateRule"},"Approves a device update rule that has been imported to the system. After a device update rule has been approved, the corresponding update will automatically be downloaded and installed by client devices affected by the update. This cmdlet was introduced in Lync Server 2010.","yes","no","no","no","no","no","yes","no","no","yes",{"$f":"\"Get-CsAdminRole | ? {$_.Cmdlets –match \"& CHAR(34) &B2& CHAR(34) &\"}\"","v":"Get-CsAdminRole | ? {$_.Cmdlets –match \"Approve-CsDeviceUpdateRule\"}"}]
[null,"Backup-CsPool",{"$f":"IF(ISTEXT(A3),(HYPERLINK(SUBSTITUTE(HLINK(A3),\".aspx\",\"\")&IF(C$1=2013,\"(v=ocs.15).aspx\",\"(v=ocs.14).aspx\"),A3)),\"\")","v":""},{"$f":"IF(ISTEXT(B3),(HYPERLINK(SUBSTITUTE(HLINK(B3),\".aspx\",\"\")&IF(D$1=2013,\"(v=ocs.15).aspx\",\"(v=ocs.14).aspx\"),B3)),\"\")","v":"Backup-CsPool"},"Creates a backup copy of the specified Lync Server 2013 pool.","yes","no","no","no","no","no","yes","no","no","no",{"$f":"\"Get-CsAdminRole | ? {$_.Cmdlets –match \"& CHAR(34) &B3& CHAR(34) &\"}\"","v":"Get-CsAdminRole | ? {$_.Cmdlets –match \"Backup-CsPool\"}"}]
["Clear-CsDeviceUpdateFile","Clear-CsDeviceUpdateFile",{"$f":"IF(ISTEXT(A4),(HYPERLINK(SUBSTITUTE(HLINK(A4),\".aspx\",\"\")&IF(C$1=2013,\"(v=ocs.15).aspx\",\"(v=ocs.14).aspx\"),A4)),\"\")","v":"Clear-CsDeviceUpdateFile"},{"$f":"IF(ISTEXT(B4),(HYPERLINK(SUBSTITUTE(HLINK(B4),\".aspx\",\"\")&IF(D$1=2013,\"(v=ocs.15).aspx\",\"(v=ocs.14).aspx\"),B4)),\"\")","v":"Clear-CsDeviceUpdateFile"},"Deletes any rejected device update files that are no longer associated with a device. This cmdlet was introduced in Lync Server 2010.","yes","no","no","no","no","no","yes","no","no","yes",{"$f":"\"Get-CsAdminRole | ? {$_.Cmdlets –match \"& CHAR(34) &B4& CHAR(34) &\"}\"","v":"Get-CsAdminRole | ? {$_.Cmdlets –match \"Clear-CsDeviceUpdateFile\"}"}]
["Clear-CsDeviceUpdateLog","Clear-CsDeviceUpdateLog",{"$f":"IF(ISTEXT(A5),(HYPERLINK(SUBSTITUTE(HLINK(A5),\".aspx\",\"\")&IF(C$1=2013,\"(v=ocs.15).aspx\",\"(v=ocs.14).aspx\"),A5)),\"\")","v":"Clear-CsDeviceUpdateLog"},{"$f":"IF(ISTEXT(B5),(HYPERLINK(SUBSTITUTE(HLINK(B5),\".aspx\",\"\")&IF(D$1=2013,\"(v=ocs.15).aspx\",\"(v=ocs.14).aspx\"),B5)),\"\")","v":"Clear-CsDeviceUpdateLog"},"Deletes all the Device Update Web service log and audit files that are older than the specified number of days. This cmdlet was introduced in Lync Server 2010.","yes","no","no","no","no","no","yes","no","no","yes","Get-CsAdminRole | ? {$_.Cmdlets –match \"Clear-CsDeviceUpdateLog\"}"]
[null,"Clear-CsPersistentChatRoom",{"$f":"IF(ISTEXT(A6),(HYPERLINK(SUBSTITUTE(HLINK(A6),\".aspx\",\"\")&IF(C$1=2013,\"(v=ocs.15).aspx\",\"(v=ocs.14).aspx\"),A6)),\"\")","v":""},{"$f":"IF(ISTEXT(B6),(HYPERLINK(SUBSTITUTE(HLINK(B6),\".aspx\",\"\")&IF(D$1=2013,\"(v=ocs.15).aspx\",\"(v=ocs.14).aspx\"),B6)),\"\")","v":"Clear-CsPersistentChatRoom"},"Removes all the content from a Persistent Chat chat room beginning with the oldest item in the room and continuing through the specified end date. This cmdlet was introduced in Lync Server 2013.","yes","no","no","no","yes","no","yes","no","no","no","Get-CsAdminRole | ? {$_.Cmdlets –match \"Clear-CsPersistentChatRoom\"}"]
[null,"Convert-CsUserData",{"$f":"IF(ISTEXT(A7),(HYPERLINK(SUBSTITUTE(HLINK(A7),\".aspx\",\"\")&IF(C$1=2013,\"(v=ocs.15).aspx\",\"(v=ocs.14).aspx\"),A7)),\"\")","v":""},{"$f":"IF(ISTEXT(B7),(HYPERLINK(SUBSTITUTE(HLINK(B7),\".aspx\",\"\")&IF(D$1=2013,\"(v=ocs.15).aspx\",\"(v=ocs.14).aspx\"),B7)),\"\")","v":"Convert-CsUserData"},"Converts exported user data to the data format used by either Microsoft Lync Server 2010 or Lync Server 2013. This cmdlet was introduced in Lync Server 2013.","no","no","no","no","no","no","no","no","no","no","Get-CsAdminRole | ? {$_.Cmdlets –match \"Convert-CsUserData\"}"]
[null,"Copy-CsVoicePolicy",{"$f":"IF(ISTEXT(A8),(HYPERLINK(SUBSTITUTE(HLINK(A8),\".aspx\",\"\")&IF(C$1=2013,\"(v=ocs.15).aspx\",\"(v=ocs.14).aspx\"),A8)),\"\")","v":""},{"$f":"IF(ISTEXT(B8),(HYPERLINK(SUBSTITUTE(HLINK(B8),\".aspx\",\"\")&IF(D$1=2013,\"(v=ocs.15).aspx\",\"(v=ocs.14).aspx\"),B8)),\"\")","v":"Copy-CsVoicePolicy"},"Copies an existing per-user voice policy to an Office 365 tenant. This cmdlet was introduced in Lync Server 2013.","yes","no","no","no","no","no","yes","no","yes","yes","Get-CsAdminRole | ? {$_.Cmdlets –match \"Copy-CsVoicePolicy\"}"]
[null,"Debug-CsAddressBookReplication",{"$f":"IF(ISTEXT(A9),(HYPERLINK(SUBSTITUTE(HLINK(A9),\".aspx\",\"\")&IF(C$1=2013,\"(v=ocs.15).aspx\",\"(v=ocs.14).aspx\"),A9)),\"\")","v":""},{"$f":"IF(ISTEXT(B9),(HYPERLINK(SUBSTITUTE(HLINK(B9),\".aspx\",\"\")&IF(D$1=2013,\"(v=ocs.15).aspx\",\"(v=ocs.14).aspx\"),B9)),\"\")","v":"Debug-CsAddressBookReplication"},"Verifies replication between Active Directory and the Lync Server 2013 Address book service. This cmdlet was introduced in Lync Server 2013.","yes","no","no","no","no","no","yes","no","no","no","Get-CsAdminRole | ? {$_.Cmdlets –match \"Debug-CsAddressBookReplication\"}"]
[null,"Debug-CsInterPoolReplication",{"$f":"IF(ISTEXT(A10),(HYPERLINK(SUBSTITUTE(HLINK(A10),\".aspx\",\"\")&IF(C$1=2013,\"(v=ocs.15).aspx\",\"(v=ocs.14).aspx\"),A10)),\"\")","v":""},{"$f":"IF(ISTEXT(B10),(HYPERLINK(SUBSTITUTE(HLINK(B10),\".aspx\",\"\")&IF(D$1=2013,\"(v=ocs.15).aspx\",\"(v=ocs.14).aspx\"),B10)),\"\")","v":"Debug-CsInterPoolReplication"},"Verifies the synchronous replication of a pool by comparing the data stored for a specified user on a primary Front End server with data for that same user stored on replica Front End servers. This cmdlet was introduced in Lync Server 2013.","yes","no","yes","no","no","no","yes","no","yes","yes","Get-CsAdminRole | ? {$_.Cmdlets –match \"Debug-CsInterPoolReplication\"}"]
[null,"Debug-CsIntraPoolReplication",{"$f":"IF(ISTEXT(A11),(HYPERLINK(SUBSTITUTE(HLINK(A11),\".aspx\",\"\")&IF(C$1=2013,\"(v=ocs.15).aspx\",\"(v=ocs.14).aspx\"),A11)),\"\")","v":""},{"$f":"IF(ISTEXT(B11),(HYPERLINK(SUBSTITUTE(HLINK(B11),\".aspx\",\"\")&IF(D$1=2013,\"(v=ocs.15).aspx\",\"(v=ocs.14).aspx\"),B11)),\"\")","v":"Debug-CsIntraPoolReplication"},"Verifies the synchronous replication of a pool by comparing the data stored for a specified user on a primary Front End server with data for that same user stored on replica Front End servers. This cmdlet was introduced in Lync Server 2013.","yes","no","yes","no","no","no","yes","no","yes","yes","Get-CsAdminRole | ? {$_.Cmdlets –match \"Debug-CsIntraPoolReplication\"}"]
["Debug-CsLisConfiguration","Debug-CsLisConfiguration",{"$f":"IF(ISTEXT(A12),(HYPERLINK(SUBSTITUTE(HLINK(A12),\".aspx\",\"\")&IF(C$1=2013,\"(v=ocs.15).aspx\",\"(v=ocs.14).aspx\"),A12)),\"\")","v":"Debug-CsLisConfiguration"},{"$f":"IF(ISTEXT(B12),(HYPERLINK(SUBSTITUTE(HLINK(B12),\".aspx\",\"\")&IF(D$1=2013,\"(v=ocs.15).aspx\",\"(v=ocs.14).aspx\"),B12)),\"\")","v":"Debug-CsLisConfiguration"},"Deletes all the Device Update Web service log and audit files that are older than the specified number of days. This cmdlet was introduced in Lync Server 2010.","yes","no","yes","yes","no","no","yes","no","yes","yes",{"$f":"\"Get-CsAdminRole | ? {$_.Cmdlets –match \"& CHAR(34) &B12& CHAR(34) &\"}\"","v":"Get-CsAdminRole | ? {$_.Cmdlets –match \"Debug-CsLisConfiguration\"}"}]
[null,"Debug-CsUnifiedContactStore",{"$f":"IF(ISTEXT(A13),(HYPERLINK(SUBSTITUTE(HLINK(A13),\".aspx\",\"\")&IF(C$1=2013,\"(v=ocs.15).aspx\",\"(v=ocs.14).aspx\"),A13)),\"\")","v":""},{"$f":"IF(ISTEXT(B13),(HYPERLINK(SUBSTITUTE(HLINK(B13),\".aspx\",\"\")&IF(D$1=2013,\"(v=ocs.15).aspx\",\"(v=ocs.14).aspx\"),B13)),\"\")","v":"Debug-CsUnifiedContactStore"},"Verifies whether the contacts for a user (or group of users) are stored in the unified contacts store. This cmdlet was introduced in the Cumulative Updates for Lync Server 2013: February 2013.\n","yes","no","yes","no","no","no","yes","yes","yes","no","Get-CsAdminRole | ? {$_.Cmdlets –match \"Debug-CsUnifiedContactStore\"}"]
["Disable-CsAdDomain","Disable-CsAdDomain",{"$f":"IF(ISTEXT(A14),(HYPERLINK(SUBSTITUTE(HLINK(A14),\".aspx\",\"\")&IF(C$1=2013,\"(v=ocs.15).aspx\",\"(v=ocs.14).aspx\"),A14)),\"\")","v":"Disable-CsAdDomain"},{"$f":"IF(ISTEXT(B14),(HYPERLINK(SUBSTITUTE(HLINK(B14),\".aspx\",\"\")&IF(D$1=2013,\"(v=ocs.15).aspx\",\"(v=ocs.14).aspx\"),B14)),\"\")","v":"Disable-CsAdDomain"},"Undoes the domain preparation tasks carried out by the Enable-CsAdDomain cmdlet. This cmdlet is typically used only if you are uninstalling Lync Server from a domain. This cmdlet was introduced in Lync Server 2010.","no","no","no","no","no","no","no","no","no","no","Get-CsAdminRole | ? {$_.Cmdlets –match \"Disable-CsAdDomain\"}"]
["Disable-CsAdForest","Disable-CsAdForest",{"$f":"IF(ISTEXT(A15),(HYPERLINK(SUBSTITUTE(HLINK(A15),\".aspx\",\"\")&IF(C$1=2013,\"(v=ocs.15).aspx\",\"(v=ocs.14).aspx\"),A15)),\"\")","v":"Disable-CsAdForest"},{"$f":"IF(ISTEXT(B15),(HYPERLINK(SUBSTITUTE(HLINK(B15),\".aspx\",\"\")&IF(D$1=2013,\"(v=ocs.15).aspx\",\"(v=ocs.14).aspx\"),B15)),\"\")","v":"Disable-CsAdForest"},"Undoes the forest preparation tasks carried out by the Enable-CsAdForest cmdlet. This cmdlet is typically used only if you are uninstalling Lync Server. This cmdlet was introduced in Lync Server 2010.","no","no","no","no","no","no","no","no","no","no","Get-CsAdminRole | ? {$_.Cmdlets –match \"Disable-CsAdForest\"}"]
["Disable-CsComputer","Disable-CsComputer",{"$f":"IF(ISTEXT(A16),(HYPERLINK(SUBSTITUTE(HLINK(A16),\".aspx\",\"\")&IF(C$1=2013,\"(v=ocs.15).aspx\",\"(v=ocs.14).aspx\"),A16)),\"\")","v":"Disable-CsComputer"},{"$f":"IF(ISTEXT(B16),(HYPERLINK(SUBSTITUTE(HLINK(B16),\".aspx\",\"\")&IF(D$1=2013,\"(v=ocs.15).aspx\",\"(v=ocs.14).aspx\"),B16)),\"\")","v":"Disable-CsComputer"},"Disables a service or server role that has been removed from a computer running Lync Server. This cmdlet was introduced in Lync Server 2010.","no","no","no","no","no","no","no","no","no","no","Get-CsAdminRole | ? {$_.Cmdlets –match \"Disable-CsComputer\"}"]
["Disable-CsHostingProvider","Disable-CsHostingProvider",{"$f":"IF(ISTEXT(A17),(HYPERLINK(SUBSTITUTE(HLINK(A17),\".aspx\",\"\")&IF(C$1=2013,\"(v=ocs.15).aspx\",\"(v=ocs.14).aspx\"),A17)),\"\")","v":"Disable-CsHostingProvider"},{"$f":"IF(ISTEXT(B17),(HYPERLINK(SUBSTITUTE(HLINK(B17),\".aspx\",\"\")&IF(D$1=2013,\"(v=ocs.15).aspx\",\"(v=ocs.14).aspx\"),B17)),\"\")","v":"Disable-CsHostingProvider"},"Disables a hosting provider currently in use in your organization. A hosting provider is a third-party organization that provides instant messaging, presence, and related services for a domain that you would like to federate with. Hosting providers, such as Microsoft Lync Online 2010, differ from public providers (such as Yahoo!, MSN, and AOL) in that their services are not offered to the general public. This cmdlet was introduced in Lync Server 2010.","yes","no","no","no","no","no","yes","no","no","no","Get-CsAdminRole | ? {$_.Cmdlets –match \"Disable-CsHostingProvider\"}"]
[null,"Disable-CsMeetingRoom",{"$f":"IF(ISTEXT(A18),(HYPERLINK(SUBSTITUTE(HLINK(A18),\".aspx\",\"\")&IF(C$1=2013,\"(v=ocs.15).aspx\",\"(v=ocs.14).aspx\"),A18)),\"\")","v":""},{"$f":"IF(ISTEXT(B18),(HYPERLINK(SUBSTITUTE(HLINK(B18),\".aspx\",\"\")&IF(D$1=2013,\"(v=ocs.15).aspx\",\"(v=ocs.14).aspx\"),B18)),\"\")","v":"Disable-CsMeetingRoom"},"Disables a Lync Server 2013 meeting room. A meeting room is a conferencing device designed to address video conferencing and collaboration scenarios in small conference rooms. When you disable a meeting room object you remove all the Lync Server-specific Active Directory attributes assigned to the user account that represents the meeting room. However, the Active Directory user account itself is not deleted. This cmdlet was introduced in Lync Server 2013.","yes","no","no","no","no","no","yes","no","no","no","Get-CsAdminRole | ? {$_.Cmdlets –match \"Disable-CsMeetingRoom\"}"]
["Disable-CsPublicProvider","Disable-CsPublicProvider",{"$f":"IF(ISTEXT(A19),(HYPERLINK(SUBSTITUTE(HLINK(A19),\".aspx\",\"\")&IF(C$1=2013,\"(v=ocs.15).aspx\",\"(v=ocs.14).aspx\"),A19)),\"\")","v":"Disable-CsPublicProvider"},{"$f":"IF(ISTEXT(B19),(HYPERLINK(SUBSTITUTE(HLINK(B19),\".aspx\",\"\")&IF(D$1=2013,\"(v=ocs.15).aspx\",\"(v=ocs.14).aspx\"),B19)),\"\")","v":"Disable-CsPublicProvider"},"Disables a public provider configured for use in your organization. A public provider is an organization that provides instant messaging, presence, and related services to the general public. Microsoft Lync Server 2010 ships with three public providers configured but not enabled: Yahoo!; AOL; and MSN.","yes","no","no","no","no","no","yes","no","no","no","Get-CsAdminRole | ? {$_.Cmdlets –match \"Disable-CsPublicProvider\"}"]
["Disable-CsUser","Disable-CsUser",{"$f":"IF(ISTEXT(A20),(HYPERLINK(SUBSTITUTE(HLINK(A20),\".aspx\",\"\")&IF(C$1=2013,\"(v=ocs.15).aspx\",\"(v=ocs.14).aspx\"),A20)),\"\")","v":"Disable-CsUser"},{"$f":"IF(ISTEXT(B20),(HYPERLINK(SUBSTITUTE(HLINK(B20),\".aspx\",\"\")&IF(D$1=2013,\"(v=ocs.15).aspx\",\"(v=ocs.14).aspx\"),B20)),\"\")","v":"Disable-CsUser"},"Modifies the Active Directory account of the specified user or users; this modification prevents users from using Microsoft Lync Server 2010 clients such as Microsoft Lync 2010. Disable-CsUser only restricts activity related to Lync Server 2010; it does not disable or remove a user's Active Directory account.","yes","no","no","no","no","no","no","yes","no","no","Get-CsAdminRole | ? {$_.Cmdlets –match \"Disable-CsUser\"}"]
["Enable-CsAdDomain","Enable-CsAdDomain",{"$f":"IF(ISTEXT(A21),(HYPERLINK(SUBSTITUTE(HLINK(A21),\".aspx\",\"\")&IF(C$1=2013,\"(v=ocs.15).aspx\",\"(v=ocs.14).aspx\"),A21)),\"\")","v":"Enable-CsAdDomain"},{"$f":"IF(ISTEXT(B21),(HYPERLINK(SUBSTITUTE(HLINK(B21),\".aspx\",\"\")&IF(D$1=2013,\"(v=ocs.15).aspx\",\"(v=ocs.14).aspx\"),B21)),\"\")","v":"Enable-CsAdDomain"},"Modifies the security settings on the universal groups created during forest preparation. These modifications provide the permissions needed to host and manage users enabled for Microsoft Lync Server 2010 within the domain.","no","no","no","no","no","no","no","no","no","no","Get-CsAdminRole | ? {$_.Cmdlets –match \"Enable-CsAdDomain\"}"]
["Enable-CsAdForest","Enable-CsAdForest",{"$f":"IF(ISTEXT(A22),(HYPERLINK(SUBSTITUTE(HLINK(A22),\".aspx\",\"\")&IF(C$1=2013,\"(v=ocs.15).aspx\",\"(v=ocs.14).aspx\"),A22)),\"\")","v":"Enable-CsAdForest"},{"$f":"IF(ISTEXT(B22),(HYPERLINK(SUBSTITUTE(HLINK(B22),\".aspx\",\"\")&IF(D$1=2013,\"(v=ocs.15).aspx\",\"(v=ocs.14).aspx\"),B22)),\"\")","v":"Enable-CsAdForest"},"Makes the Active Directory modifications required before you can install Microsoft Lync Server 2010. This includes making global changes to the Configuration or System containers; creating universal groups; and creating property sets and display specifiers that are specific to Lync Server 2010.","no","no","no","no","no","no","no","no","no","no","Get-CsAdminRole | ? {$_.Cmdlets –match \"Enable-CsAdForest\"}"]
["Enable-CsComputer","Enable-CsComputer",{"$f":"IF(ISTEXT(A23),(HYPERLINK(SUBSTITUTE(HLINK(A23),\".aspx\",\"\")&IF(C$1=2013,\"(v=ocs.15).aspx\",\"(v=ocs.14).aspx\"),A23)),\"\")","v":"Enable-CsComputer"},{"$f":"IF(ISTEXT(B23),(HYPERLINK(SUBSTITUTE(HLINK(B23),\".aspx\",\"\")&IF(D$1=2013,\"(v=ocs.15).aspx\",\"(v=ocs.14).aspx\"),B23)),\"\")","v":"Enable-CsComputer"},"Enables new or newly-updated services or server roles on a computer running Microsoft Lync Server 2010.","no","no","no","no","no","no","no","no","no","no","Get-CsAdminRole | ? {$_.Cmdlets –match \"Enable-CsComputer\"}"]
["Enable-CsHostingProvider","Enable-CsHostingProvider",{"$f":"IF(ISTEXT(A24),(HYPERLINK(SUBSTITUTE(HLINK(A24),\".aspx\",\"\")&IF(C$1=2013,\"(v=ocs.15).aspx\",\"(v=ocs.14).aspx\"),A24)),\"\")","v":"Enable-CsHostingProvider"},{"$f":"IF(ISTEXT(B24),(HYPERLINK(SUBSTITUTE(HLINK(B24),\".aspx\",\"\")&IF(D$1=2013,\"(v=ocs.15).aspx\",\"(v=ocs.14).aspx\"),B24)),\"\")","v":"Enable-CsHostingProvider"},"Enables a hosting provider for use in your organization. A hosting provider is a third-party organization that provides instant messaging, presence, and related services for a domain that you would like to federate with. Hosting providers, such as Microsoft Lync Online 2010, differ from public providers (such as Yahoo!, MSN, and AOL) in that their services are not offered to the general public.","yes","no","no","no","no","no","yes","no","no","no","Get-CsAdminRole | ? {$_.Cmdlets –match \"Enable-CsHostingProvider\"}"]
[null,"Enable-CsMeetingRoom",{"$f":"IF(ISTEXT(A25),(HYPERLINK(SUBSTITUTE(HLINK(A25),\".aspx\",\"\")&IF(C$1=2013,\"(v=ocs.15).aspx\",\"(v=ocs.14).aspx\"),A25)),\"\")","v":""},{"$f":"IF(ISTEXT(B25),(HYPERLINK(SUBSTITUTE(HLINK(B25),\".aspx\",\"\")&IF(D$1=2013,\"(v=ocs.15).aspx\",\"(v=ocs.14).aspx\"),B25)),\"\")","v":"Enable-CsMeetingRoom"},"Enables a Lync Server 2013 meeting room. A meeting room is a conferencing device designed to address video conferencing and collaboration scenarios in small conference rooms. To enable a meeting room you must first create an Active Directory user account that will represent that system. Note that, although meeting room objects are based on user accounts, these objects will not show up when you run the Get-CsUser cmdlet. This cmdlet was introduced in Lync Server 2013.","yes","no","no","no","no","no","no","yes","no","no","Get-CsAdminRole | ? {$_.Cmdlets –match \"Enable-CsMeetingRoom\"}"]
["Enable-CsPublicProvider","Enable-CsPublicProvider",{"$f":"IF(ISTEXT(A26),(HYPERLINK(SUBSTITUTE(HLINK(A26),\".aspx\",\"\")&IF(C$1=2013,\"(v=ocs.15).aspx\",\"(v=ocs.14).aspx\"),A26)),\"\")","v":"Enable-CsPublicProvider"},{"$f":"IF(ISTEXT(B26),(HYPERLINK(SUBSTITUTE(HLINK(B26),\".aspx\",\"\")&IF(D$1=2013,\"(v=ocs.15).aspx\",\"(v=ocs.14).aspx\"),B26)),\"\")","v":"Enable-CsPublicProvider"},"Enables a public provider configured for use in your organization. A public provider is an organization that provides instant messaging, presence, and related services to the general public. Microsoft Lync Server 2010 ships with three public providers configured but not enabled: Yahoo!; AOL; and MSN.","yes","no","no","no","no","no","yes","no","no","no","Get-CsAdminRole | ? {$_.Cmdlets –match \"Enable-CsPublicProvider\"}"]
["Enable-CsReplica","Enable-CsReplica",{"$f":"IF(ISTEXT(A27),(HYPERLINK(SUBSTITUTE(HLINK(A27),\".aspx\",\"\")&IF(C$1=2013,\"(v=ocs.15).aspx\",\"(v=ocs.14).aspx\"),A27)),\"\")","v":"Enable-CsReplica"},{"$f":"IF(ISTEXT(B27),(HYPERLINK(SUBSTITUTE(HLINK(B27),\".aspx\",\"\")&IF(D$1=2013,\"(v=ocs.15).aspx\",\"(v=ocs.14).aspx\"),B27)),\"\")","v":"Enable-CsReplica"},"Adds the local computer to the Microsoft Lync Server 2010 replication path.","no","no","no","no","no","no","no","no","no","no","Get-CsAdminRole | ? {$_.Cmdlets –match \"Enable-CsReplica\"}"]
["Enable-CsTopology","Enable-CsTopology",{"$f":"IF(ISTEXT(A28),(HYPERLINK(SUBSTITUTE(HLINK(A28),\".aspx\",\"\")&IF(C$1=2013,\"(v=ocs.15).aspx\",\"(v=ocs.14).aspx\"),A28)),\"\")","v":"Enable-CsTopology"},{"$f":"IF(ISTEXT(B28),(HYPERLINK(SUBSTITUTE(HLINK(B28),\".aspx\",\"\")&IF(D$1=2013,\"(v=ocs.15).aspx\",\"(v=ocs.14).aspx\"),B28)),\"\")","v":"Enable-CsTopology"},"Enables the most recently published Microsoft Lync Server 2010 topology. After you have made changes to your topology, the changes will not take effect until they have been both published and enabled.","no","no","no","no","no","no","no","no","no","no","Get-CsAdminRole | ? {$_.Cmdlets –match \"Enable-CsTopology\"}"]
["Enable-CsUser","Enable-CsUser",{"$f":"IF(ISTEXT(A29),(HYPERLINK(SUBSTITUTE(HLINK(A29),\".aspx\",\"\")&IF(C$1=2013,\"(v=ocs.15).aspx\",\"(v=ocs.14).aspx\"),A29)),\"\")","v":"Enable-CsUser"},{"$f":"IF(ISTEXT(B29),(HYPERLINK(SUBSTITUTE(HLINK(B29),\".aspx\",\"\")&IF(D$1=2013,\"(v=ocs.15).aspx\",\"(v=ocs.14).aspx\"),B29)),\"\")","v":"Enable-CsUser"},"Enables one or more users for Microsoft Lync Server 2010. Users cannot use Microsoft Lync 2010 or other Lync Server 2010 clients until their user accounts have been enabled for Lync Server.","yes","no","no","no","no","no","no","yes","no","no","Get-CsAdminRole | ? {$_.Cmdlets –match \"Enable-CsUser\"}"]
["Export-CsArchivingData","Export-CsArchivingData",{"$f":"IF(ISTEXT(A30),(HYPERLINK(SUBSTITUTE(HLINK(A30),\".aspx\",\"\")&IF(C$1=2013,\"(v=ocs.15).aspx\",\"(v=ocs.14).aspx\"),A30)),\"\")","v":"Export-CsArchivingData"},{"$f":"IF(ISTEXT(B30),(HYPERLINK(SUBSTITUTE(HLINK(B30),\".aspx\",\"\")&IF(D$1=2013,\"(v=ocs.15).aspx\",\"(v=ocs.14).aspx\"),B30)),\"\")","v":"Export-CsArchivingData"},"Enables you to export records that have been stored in the Microsoft Lync Server 2010 Archiving database.","yes","yes","no","no","no","no","no","no","no","no","Get-CsAdminRole | ? {$_.Cmdlets –match \"Export-CsArchivingData\"}"]
["Export-CsConfiguration","Export-CsConfiguration",{"$f":"IF(ISTEXT(A31),(HYPERLINK(SUBSTITUTE(HLINK(A31),\".aspx\",\"\")&IF(C$1=2013,\"(v=ocs.15).aspx\",\"(v=ocs.14).aspx\"),A31)),\"\")","v":"Export-CsConfiguration"},{"$f":"IF(ISTEXT(B31),(HYPERLINK(SUBSTITUTE(HLINK(B31),\".aspx\",\"\")&IF(D$1=2013,\"(v=ocs.15).aspx\",\"(v=ocs.14).aspx\"),B31)),\"\")","v":"Export-CsConfiguration"},"Exports your Microsoft Lync Server 2010 topology, policies, and configuration settings to a file. Among other things, this file can then be used to restore this information to the Central Management store after an upgrade, a hardware failure, or some other issue has resulted in data loss.","yes","no","no","no","no","no","yes","no","no","no","Get-CsAdminRole | ? {$_.Cmdlets –match \"Export-CsConfiguration\"}"]
["Export-CsLisConfiguration","Export-CsLisConfiguration",{"$f":"IF(ISTEXT(A32),(HYPERLINK(SUBSTITUTE(HLINK(A32),\".aspx\",\"\")&IF(C$1=2013,\"(v=ocs.15).aspx\",\"(v=ocs.14).aspx\"),A32)),\"\")","v":"Export-CsLisConfiguration"},{"$f":"IF(ISTEXT(B32),(HYPERLINK(SUBSTITUTE(HLINK(B32),\".aspx\",\"\")&IF(D$1=2013,\"(v=ocs.15).aspx\",\"(v=ocs.14).aspx\"),B32)),\"\")","v":"Export-CsLisConfiguration"},"Exports an Enterprise Voice Enhanced 9-1-1 (E9-1-1) configuration to a file in compressed format for backup purposes.","yes","no","no","yes","no","no","yes","no","no","yes","Get-CsAdminRole | ? {$_.Cmdlets –match \"Export-CsLisConfiguration\"}"]
[null,"Export-CsPersistentChatData",{"$f":"IF(ISTEXT(A33),(HYPERLINK(SUBSTITUTE(HLINK(A33),\".aspx\",\"\")&IF(C$1=2013,\"(v=ocs.15).aspx\",\"(v=ocs.14).aspx\"),A33)),\"\")","v":""},{"$f":"IF(ISTEXT(B33),(HYPERLINK(SUBSTITUTE(HLINK(B33),\".aspx\",\"\")&IF(D$1=2013,\"(v=ocs.15).aspx\",\"(v=ocs.14).aspx\"),B33)),\"\")","v":"Export-CsPersistentChatData"},"Exports data from a Persistent Chat database. This cmdlet was introduced in Lync Server 2013.","yes","no","no","no","yes","no","yes","no","no","no","Get-CsAdminRole | ? {$_.Cmdlets –match \"Export-CsPersistentChatData\"}"]
[null,"Export-CsRgsConfiguration",{"$f":"IF(ISTEXT(A34),(HYPERLINK(SUBSTITUTE(HLINK(A34),\".aspx\",\"\")&IF(C$1=2013,\"(v=ocs.15).aspx\",\"(v=ocs.14).aspx\"),A34)),\"\")","v":""},{"$f":"IF(ISTEXT(B34),(HYPERLINK(SUBSTITUTE(HLINK(B34),\".aspx\",\"\")&IF(D$1=2013,\"(v=ocs.15).aspx\",\"(v=ocs.14).aspx\"),B34)),\"\")","v":"Export-CsRgsConfiguration"},"Exports data from an existing Response Group application configuration. This data, saved as a .ZIP file, can later be imported using the Import-CsRgsConfiguration cmdlet. The ability to export and import Response Group configuration data is particularly useful disaster recovery scenarios.","no","no","no","no","no","no","no","no","no","no","Get-CsAdminRole | ? {$_.Cmdlets –match \"Export-CsRgsConfiguration\"}"]
[null,"Export-CsUserData",{"$f":"IF(ISTEXT(A35),(HYPERLINK(SUBSTITUTE(HLINK(A35),\".aspx\",\"\")&IF(C$1=2013,\"(v=ocs.15).aspx\",\"(v=ocs.14).aspx\"),A35)),\"\")","v":""},{"$f":"IF(ISTEXT(B35),(HYPERLINK(SUBSTITUTE(HLINK(B35),\".aspx\",\"\")&IF(D$1=2013,\"(v=ocs.15).aspx\",\"(v=ocs.14).aspx\"),B35)),\"\")","v":"Export-CsUserData"},"Exports user data in a format that can be imported into Microsoft Exchange Server 2013. The data will be exported as a .ZIP file containing a pair of XML documents. This cmdlet was introduced in Lync Server 2013.","yes","no","no","no","no","no","yes","yes","no","no","Get-CsAdminRole | ? {$_.Cmdlets –match \"Export-CsUserData\"}"]
["Get-CsAccessEdgeConfiguration","Get-CsAccessEdgeConfiguration",{"$f":"IF(ISTEXT(A36),(HYPERLINK(SUBSTITUTE(HLINK(A36),\".aspx\",\"\")&IF(C$1=2013,\"(v=ocs.15).aspx\",\"(v=ocs.14).aspx\"),A36)),\"\")","v":"Get-CsAccessEdgeConfiguration"},{"$f":"IF(ISTEXT(B36),(HYPERLINK(SUBSTITUTE(HLINK(B36),\".aspx\",\"\")&IF(D$1=2013,\"(v=ocs.15).aspx\",\"(v=ocs.14).aspx\"),B36)),\"\")","v":"Get-CsAccessEdgeConfiguration"},"Returns information about the configuration settings for computers running the Access Edge service in your organization (also known as Access Edge servers). Access Edge servers provide a way for users outside your internal network to communicate with users inside your internal network.","yes","no","yes","no","no","no","yes","no","yes","no","Get-CsAdminRole | ? {$_.Cmdlets –match \"Get-CsAccessEdgeConfiguration\"}"]
["Get-CsAdContact","Get-CsAdContact",{"$f":"IF(ISTEXT(A37),(HYPERLINK(SUBSTITUTE(HLINK(A37),\".aspx\",\"\")&IF(C$1=2013,\"(v=ocs.15).aspx\",\"(v=ocs.14).aspx\"),A37)),\"\")","v":"Get-CsAdContact"},{"$f":"IF(ISTEXT(B37),(HYPERLINK(SUBSTITUTE(HLINK(B37),\".aspx\",\"\")&IF(D$1=2013,\"(v=ocs.15).aspx\",\"(v=ocs.14).aspx\"),B37)),\"\")","v":"Get-CsAdContact"},"In a multi-forest topology, returns information about user accounts from forests other than your home forest; these are users who have been replicated as contact objects by Microsoft Forefront Identity Manager 2010 (or a previous version of the product). Get-CsAdContact returns any user who has a value configured for the msRTCSIP-OriginatorSid attribute.","yes","no","yes","no","no","no","yes","yes","yes","yes","Get-CsAdminRole | ? {$_.Cmdlets –match \"Get-CsAdContact\"}"]
["Get-CsAdDomain","Get-CsAdDomain",{"$f":"IF(ISTEXT(A38),(HYPERLINK(SUBSTITUTE(HLINK(A38),\".aspx\",\"\")&IF(C$1=2013,\"(v=ocs.15).aspx\",\"(v=ocs.14).aspx\"),A38)),\"\")","v":"Get-CsAdDomain"},{"$f":"IF(ISTEXT(B38),(HYPERLINK(SUBSTITUTE(HLINK(B38),\".aspx\",\"\")&IF(D$1=2013,\"(v=ocs.15).aspx\",\"(v=ocs.14).aspx\"),B38)),\"\")","v":"Get-CsAdDomain"},"Returns information indicating whether Active Directory Domain Services (AD DS) has been correctly configured to allow for the installation of Microsoft Lync Server 2010.","no","no","no","no","no","no","no","no","no","no","Get-CsAdminRole | ? {$_.Cmdlets –match \"Get-CsAdDomain\"}"]
["Get-CsAddressBookConfiguration","Get-CsAddressBookConfiguration",{"$f":"IF(ISTEXT(A39),(HYPERLINK(SUBSTITUTE(HLINK(A39),\".aspx\",\"\")&IF(C$1=2013,\"(v=ocs.15).aspx\",\"(v=ocs.14).aspx\"),A39)),\"\")","v":"Get-CsAddressBookConfiguration"},{"$f":"IF(ISTEXT(B39),(HYPERLINK(SUBSTITUTE(HLINK(B39),\".aspx\",\"\")&IF(D$1=2013,\"(v=ocs.15).aspx\",\"(v=ocs.14).aspx\"),B39)),\"\")","v":"Get-CsAddressBookConfiguration"},"Returns information about Address Book configuration settings.","yes","no","yes","no","no","no","yes","no","yes","no","Get-CsAdminRole | ? {$_.Cmdlets –match \"Get-CsAddressBookConfiguration\"}"]
["Get-CsAdForest","Get-CsAdForest",{"$f":"IF(ISTEXT(A40),(HYPERLINK(SUBSTITUTE(HLINK(A40),\".aspx\",\"\")&IF(C$1=2013,\"(v=ocs.15).aspx\",\"(v=ocs.14).aspx\"),A40)),\"\")","v":"Get-CsAdForest"},{"$f":"IF(ISTEXT(B40),(HYPERLINK(SUBSTITUTE(HLINK(B40),\".aspx\",\"\")&IF(D$1=2013,\"(v=ocs.15).aspx\",\"(v=ocs.14).aspx\"),B40)),\"\")","v":"Get-CsAdForest"},"Returns information indicating whether your Active Directory forest has been correctly configured to allow for the installation of Microsoft Lync Server 2010.","no","no","no","no","no","no","no","no","no","no","Get-CsAdminRole | ? {$_.Cmdlets –match \"Get-CsAdForest\"}"]
["Get-CsAdminRole","Get-CsAdminRole",{"$f":"IF(ISTEXT(A41),(HYPERLINK(SUBSTITUTE(HLINK(A41),\".aspx\",\"\")&IF(C$1=2013,\"(v=ocs.15).aspx\",\"(v=ocs.14).aspx\"),A41)),\"\")","v":"Get-CsAdminRole"},{"$f":"IF(ISTEXT(B41),(HYPERLINK(SUBSTITUTE(HLINK(B41),\".aspx\",\"\")&IF(D$1=2013,\"(v=ocs.15).aspx\",\"(v=ocs.14).aspx\"),B41)),\"\")","v":"Get-CsAdminRole"},"Returns information about the role-based access control (RBAC) roles used in your organization. RBAC roles are used to specify the management tasks that users are allowed to carry out, and to determine the scope in which users will be allowed to perform these tasks.","yes","no","no","no","no","no","yes","no","no","no","Get-CsAdminRole | ? {$_.Cmdlets –match \"Get-CsAdminRole\"}"]
["Get-CsAdminRoleAssignment","Get-CsAdminRoleAssignment",{"$f":"IF(ISTEXT(A42),(HYPERLINK(SUBSTITUTE(HLINK(A42),\".aspx\",\"\")&IF(C$1=2013,\"(v=ocs.15).aspx\",\"(v=ocs.14).aspx\"),A42)),\"\")","v":"Get-CsAdminRoleAssignment"},{"$f":"IF(ISTEXT(B42),(HYPERLINK(SUBSTITUTE(HLINK(B42),\".aspx\",\"\")&IF(D$1=2013,\"(v=ocs.15).aspx\",\"(v=ocs.14).aspx\"),B42)),\"\")","v":"Get-CsAdminRoleAssignment"},"Returns the role-based access control (RBAC) roles assigned to a user.","yes","no","no","no","no","no","yes","no","no","no","Get-CsAdminRole | ? {$_.Cmdlets –match \"Get-CsAdminRoleAssignment\"}"]
[null,"Get-CsAdPrincipal",{"$f":"IF(ISTEXT(A43),(HYPERLINK(SUBSTITUTE(HLINK(A43),\".aspx\",\"\")&IF(C$1=2013,\"(v=ocs.15).aspx\",\"(v=ocs.14).aspx\"),A43)),\"\")","v":""},{"$f":"IF(ISTEXT(B43),(HYPERLINK(SUBSTITUTE(HLINK(B43),\".aspx\",\"\")&IF(D$1=2013,\"(v=ocs.15).aspx\",\"(v=ocs.14).aspx\"),B43)),\"\")","v":"Get-CsAdPrincipal"},"Returns information about Active Directory principals. These principals include Active Directory objects such as users, groups, contacts, containers, and organizational units. This cmdlet was introduced in Lync Server 2013.","yes","no","no","no","yes","no","yes","no","no","no","Get-CsAdminRole | ? {$_.Cmdlets –match \"Get-CsAdPrincipal\"}"]
["Get-CsAdServerSchema","Get-CsAdServerSchema",{"$f":"IF(ISTEXT(A44),(HYPERLINK(SUBSTITUTE(HLINK(A44),\".aspx\",\"\")&IF(C$1=2013,\"(v=ocs.15).aspx\",\"(v=ocs.14).aspx\"),A44)),\"\")","v":"Get-CsAdServerSchema"},{"$f":"IF(ISTEXT(B44),(HYPERLINK(SUBSTITUTE(HLINK(B44),\".aspx\",\"\")&IF(D$1=2013,\"(v=ocs.15).aspx\",\"(v=ocs.14).aspx\"),B44)),\"\")","v":"Get-CsAdServerSchema"},"Returns information indicating whether your Active Directory schema has been correctly configured to allow for the installation of Microsoft Lync Server 2010.","no","no","no","no","no","no","no","no","no","no","Get-CsAdminRole | ? {$_.Cmdlets –match \"Get-CsAdServerSchema\"}"]
["Get-CsAdUser","Get-CsAdUser",{"$f":"IF(ISTEXT(A45),(HYPERLINK(SUBSTITUTE(HLINK(A45),\".aspx\",\"\")&IF(C$1=2013,\"(v=ocs.15).aspx\",\"(v=ocs.14).aspx\"),A45)),\"\")","v":"Get-CsAdUser"},{"$f":"IF(ISTEXT(B45),(HYPERLINK(SUBSTITUTE(HLINK(B45),\".aspx\",\"\")&IF(D$1=2013,\"(v=ocs.15).aspx\",\"(v=ocs.14).aspx\"),B45)),\"\")","v":"Get-CsAdUser"},"Returns information about all the user accounts in Active Directory Domain Services (AD DS). This includes user accounts that have been enabled for Microsoft Lync Server 2010 as well as accounts that have not been enabled for Lync Server 2010.","yes","no","yes","no","no","no","yes","yes","yes","yes",{"$f":"\"Get-CsAdminRole | ? {$_.Cmdlets –match \"& CHAR(34) &B45& CHAR(34) &\"}\"","v":"Get-CsAdminRole | ? {$_.Cmdlets –match \"Get-CsAdUser\"}"}]
["Get-CsAllowedDomain","Get-CsAllowedDomain",{"$f":"IF(ISTEXT(A46),(HYPERLINK(SUBSTITUTE(HLINK(A46),\".aspx\",\"\")&IF(C$1=2013,\"(v=ocs.15).aspx\",\"(v=ocs.14).aspx\"),A46)),\"\")","v":"Get-CsAllowedDomain"},{"$f":"IF(ISTEXT(B46),(HYPERLINK(SUBSTITUTE(HLINK(B46),\".aspx\",\"\")&IF(D$1=2013,\"(v=ocs.15).aspx\",\"(v=ocs.14).aspx\"),B46)),\"\")","v":"Get-CsAllowedDomain"},"Returns information about the domains included on the list of domains approved for federation. After a domain has been approved for federation (by being added to the allowed list), your users can exchange instant messages and presence information with people who have accounts in that domain.","yes","no","yes","no","no","no","yes","no","yes","no","Get-CsAdminRole | ? {$_.Cmdlets –match \"Get-CsAllowedDomain\"}"]
["Get-CsAnalogDevice","Get-CsAnalogDevice",{"$f":"IF(ISTEXT(A47),(HYPERLINK(SUBSTITUTE(HLINK(A47),\".aspx\",\"\")&IF(C$1=2013,\"(v=ocs.15).aspx\",\"(v=ocs.14).aspx\"),A47)),\"\")","v":"Get-CsAnalogDevice"},{"$f":"IF(ISTEXT(B47),(HYPERLINK(SUBSTITUTE(HLINK(B47),\".aspx\",\"\")&IF(D$1=2013,\"(v=ocs.15).aspx\",\"(v=ocs.14).aspx\"),B47)),\"\")","v":"Get-CsAnalogDevice"},"Returns information about the analog devices you can manage by using Microsoft Lync Server 2010. An analog device is a telephone or other device that is connected to the public switched telephone network.","yes","no","yes","no","no","no","yes","yes","yes","yes","Get-CsAdminRole | ? {$_.Cmdlets –match \"Get-CsAnalogDevice\"}"]
["Get-CsAnnouncement","Get-CsAnnouncement",{"$f":"IF(ISTEXT(A48),(HYPERLINK(SUBSTITUTE(HLINK(A48),\".aspx\",\"\")&IF(C$1=2013,\"(v=ocs.15).aspx\",\"(v=ocs.14).aspx\"),A48)),\"\")","v":"Get-CsAnnouncement"},{"$f":"IF(ISTEXT(B48),(HYPERLINK(SUBSTITUTE(HLINK(B48),\".aspx\",\"\")&IF(D$1=2013,\"(v=ocs.15).aspx\",\"(v=ocs.14).aspx\"),B48)),\"\")","v":"Get-CsAnnouncement"},"Returns information about the Microsoft Lync Server 2010 announcements configured for use in your organization. Announcements are played when users dial a valid but unassigned phone number. An announcement can be a message (such as \"This number is temporarily out of service\") or a busy signal.","yes","no","yes","no","no","no","yes","no","yes","yes","Get-CsAdminRole | ? {$_.Cmdlets –match \"Get-CsAnnouncement\"}"]
["Get-CsApplicationEndpoint","Get-CsApplicationEndpoint",{"$f":"IF(ISTEXT(A49),(HYPERLINK(SUBSTITUTE(HLINK(A49),\".aspx\",\"\")&IF(C$1=2013,\"(v=ocs.15).aspx\",\"(v=ocs.14).aspx\"),A49)),\"\")","v":"Get-CsApplicationEndpoint"},{"$f":"IF(ISTEXT(B49),(HYPERLINK(SUBSTITUTE(HLINK(B49),\".aspx\",\"\")&IF(D$1=2013,\"(v=ocs.15).aspx\",\"(v=ocs.14).aspx\"),B49)),\"\")","v":"Get-CsApplicationEndpoint"},"Retrieves endpoints for the Application service.","yes","no","no","no","no","no","yes","no","no","yes","Get-CsAdminRole | ? {$_.Cmdlets –match \"Get-CsApplicationEndpoint\"}"]
["Get-CsArchivingConfiguration","Get-CsArchivingConfiguration",{"$f":"IF(ISTEXT(A50),(HYPERLINK(SUBSTITUTE(HLINK(A50),\".aspx\",\"\")&IF(C$1=2013,\"(v=ocs.15).aspx\",\"(v=ocs.14).aspx\"),A50)),\"\")","v":"Get-CsArchivingConfiguration"},{"$f":"IF(ISTEXT(B50),(HYPERLINK(SUBSTITUTE(HLINK(B50),\".aspx\",\"\")&IF(D$1=2013,\"(v=ocs.15).aspx\",\"(v=ocs.14).aspx\"),B50)),\"\")","v":"Get-CsArchivingConfiguration"},"Returns information about how (or if) instant messaging (IM) sessions are archived in your organization.","yes","yes","yes","no","no","no","yes","yes","yes","no","Get-CsAdminRole | ? {$_.Cmdlets –match \"Get-CsArchivingConfiguration\"}"]
["Get-CsArchivingPolicy","Get-CsArchivingPolicy",{"$f":"IF(ISTEXT(A51),(HYPERLINK(SUBSTITUTE(HLINK(A51),\".aspx\",\"\")&IF(C$1=2013,\"(v=ocs.15).aspx\",\"(v=ocs.14).aspx\"),A51)),\"\")","v":"Get-CsArchivingPolicy"},{"$f":"IF(ISTEXT(B51),(HYPERLINK(SUBSTITUTE(HLINK(B51),\".aspx\",\"\")&IF(D$1=2013,\"(v=ocs.15).aspx\",\"(v=ocs.14).aspx\"),B51)),\"\")","v":"Get-CsArchivingPolicy"},"Returns information about your instant messaging (IM) session archiving policies. Archiving policies enable you to archive all IM and web conferencing sessions that take place between internal users and/or between internal users and external users.","yes","yes","yes","no","no","no","yes","yes","yes","no","Get-CsAdminRole | ? {$_.Cmdlets –match \"Get-CsArchivingPolicy\"}"]
["Get-CsAudioTestServiceApplication","Get-CsAudioTestServiceApplication",{"$f":"IF(ISTEXT(A52),(HYPERLINK(SUBSTITUTE(HLINK(A52),\".aspx\",\"\")&IF(C$1=2013,\"(v=ocs.15).aspx\",\"(v=ocs.14).aspx\"),A52)),\"\")","v":"Get-CsAudioTestServiceApplication"},{"$f":"IF(ISTEXT(B52),(HYPERLINK(SUBSTITUTE(HLINK(B52),\".aspx\",\"\")&IF(D$1=2013,\"(v=ocs.15).aspx\",\"(v=ocs.14).aspx\"),B52)),\"\")","v":"Get-CsAudioTestServiceApplication"},"Enables you to return information about the Audio Test service application used in your organization.","yes","no","yes","no","no","no","yes","no","yes","yes","Get-CsAdminRole | ? {$_.Cmdlets –match \"Get-CsAudioTestServiceApplication\"}"]
["Get-CsAutoDiscoverConfiguration","Get-CsAutodiscoverConfiguration",{"$f":"IF(ISTEXT(A53),(HYPERLINK(SUBSTITUTE(HLINK(A53),\".aspx\",\"\")&IF(C$1=2013,\"(v=ocs.15).aspx\",\"(v=ocs.14).aspx\"),A53)),\"\")","v":"Get-CsAutoDiscoverConfiguration"},{"$f":"IF(ISTEXT(B53),(HYPERLINK(SUBSTITUTE(HLINK(B53),\".aspx\",\"\")&IF(D$1=2013,\"(v=ocs.15).aspx\",\"(v=ocs.14).aspx\"),B53)),\"\")","v":"Get-CsAutodiscoverConfiguration"},"Returns information about the Autodiscover configuration settings currently in use in an organization. The Autodiscover service provides a way for client applications such as Lync Web App to locate key resources such as a user's home pool or the URL for joining a dial-in conference. This cmdlet was introduced in the cumulative update for Lync Server 2010: November 2011.","yes","no","no","no","no","no","yes","no","yes","no","Get-CsAdminRole | ? {$_.Cmdlets –match \"Get-CsAutodiscoverConfiguration\"}"]
["Get-CsAVEdgeConfiguration","Get-CsAVEdgeConfiguration",{"$f":"IF(ISTEXT(A54),(HYPERLINK(SUBSTITUTE(HLINK(A54),\".aspx\",\"\")&IF(C$1=2013,\"(v=ocs.15).aspx\",\"(v=ocs.14).aspx\"),A54)),\"\")","v":"Get-CsAVEdgeConfiguration"},{"$f":"IF(ISTEXT(B54),(HYPERLINK(SUBSTITUTE(HLINK(B54),\".aspx\",\"\")&IF(D$1=2013,\"(v=ocs.15).aspx\",\"(v=ocs.14).aspx\"),B54)),\"\")","v":"Get-CsAVEdgeConfiguration"},"Returns configuration information for computers running the A/V Edge service in your organization. The configuration settings on these computers, also known as A/V Edge servers, enable internal users to share audio and video data with external users (that is, users who are not logged on to your internal network), as well as exchange files and participate in desktop sharing sessions.","yes","no","yes","no","no","no","yes","no","yes","no","Get-CsAdminRole | ? {$_.Cmdlets –match \"Get-CsAVEdgeConfiguration\"}"]
[null,"Get-CsBackupServiceConfiguration",{"$f":"IF(ISTEXT(A55),(HYPERLINK(SUBSTITUTE(HLINK(A55),\".aspx\",\"\")&IF(C$1=2013,\"(v=ocs.15).aspx\",\"(v=ocs.14).aspx\"),A55)),\"\")","v":""},{"$f":"IF(ISTEXT(B55),(HYPERLINK(SUBSTITUTE(HLINK(B55),\".aspx\",\"\")&IF(D$1=2013,\"(v=ocs.15).aspx\",\"(v=ocs.14).aspx\"),B55)),\"\")","v":"Get-CsBackupServiceConfiguration"},"Retrieves the backup service configuration settings for Lync Server 2013. These settings include information about the maximum number of simultaneous Windows Communication Framework calls that can be made to the backup service, as well as the backup service synchronization interval. This cmdlet was introduced in Lync Server 2013.","yes","no","no","no","no","no","yes","no","yes","no","Get-CsAdminRole | ? {$_.Cmdlets –match \"Get-CsBackupServiceConfiguration\"}"]
[null,"Get-CsBackupServiceStatus",{"$f":"IF(ISTEXT(A56),(HYPERLINK(SUBSTITUTE(HLINK(A56),\".aspx\",\"\")&IF(C$1=2013,\"(v=ocs.15).aspx\",\"(v=ocs.14).aspx\"),A56)),\"\")","v":""},{"$f":"IF(ISTEXT(B56),(HYPERLINK(SUBSTITUTE(HLINK(B56),\".aspx\",\"\")&IF(D$1=2013,\"(v=ocs.15).aspx\",\"(v=ocs.14).aspx\"),B56)),\"\")","v":"Get-CsBackupServiceStatus"},"Returns information about the current state of the backup service for a specified pool. This cmdlet was introduced in Lync Server 2013.","yes","no","no","no","no","no","yes","no","yes","no","Get-CsAdminRole | ? {$_.Cmdlets –match \"Get-CsBackupServiceStatus\"}"]
["Get-CsBandwidthPolicyServiceConfiguration","Get-CsBandwidthPolicyServiceConfiguration",{"$f":"IF(ISTEXT(A57),(HYPERLINK(SUBSTITUTE(HLINK(A57),\".aspx\",\"\")&IF(C$1=2013,\"(v=ocs.15).aspx\",\"(v=ocs.14).aspx\"),A57)),\"\")","v":"Get-CsBandwidthPolicyServiceConfiguration"},{"$f":"IF(ISTEXT(B57),(HYPERLINK(SUBSTITUTE(HLINK(B57),\".aspx\",\"\")&IF(D$1=2013,\"(v=ocs.15).aspx\",\"(v=ocs.14).aspx\"),B57)),\"\")","v":"Get-CsBandwidthPolicyServiceConfiguration"},"Retrieves one or more bandwidth policy service configurations.","yes","no","yes","no","no","no","yes","no","yes","yes","Get-CsAdminRole | ? {$_.Cmdlets –match \"Get-CsBandwidthPolicyServiceConfiguration\"}"]
["Get-CsBlockedDomain","Get-CsBlockedDomain",{"$f":"IF(ISTEXT(A58),(HYPERLINK(SUBSTITUTE(HLINK(A58),\".aspx\",\"\")&IF(C$1=2013,\"(v=ocs.15).aspx\",\"(v=ocs.14).aspx\"),A58)),\"\")","v":"Get-CsBlockedDomain"},{"$f":"IF(ISTEXT(B58),(HYPERLINK(SUBSTITUTE(HLINK(B58),\".aspx\",\"\")&IF(D$1=2013,\"(v=ocs.15).aspx\",\"(v=ocs.14).aspx\"),B58)),\"\")","v":"Get-CsBlockedDomain"},"Returns information about the domains that are included on the list of domains blocked for federation. By definition, your users are not allowed to use Microsoft Lync Server 2010 applications to communicate with people from the blocked domain; for example, users cannot use Microsoft Lync 2010 to exchange instant messages with anyone with a Session Initiation Protocol (SIP) account in a domain on the blocked list.","yes","no","yes","no","no","no","yes","no","yes","no","Get-CsAdminRole | ? {$_.Cmdlets –match \"Get-CsBlockedDomain\"}"]
["Get-CsCallParkOrbit","Get-CsCallParkOrbit",{"$f":"IF(ISTEXT(A59),(HYPERLINK(SUBSTITUTE(HLINK(A59),\".aspx\",\"\")&IF(C$1=2013,\"(v=ocs.15).aspx\",\"(v=ocs.14).aspx\"),A59)),\"\")","v":"Get-CsCallParkOrbit"},{"$f":"IF(ISTEXT(B59),(HYPERLINK(SUBSTITUTE(HLINK(B59),\".aspx\",\"\")&IF(D$1=2013,\"(v=ocs.15).aspx\",\"(v=ocs.14).aspx\"),B59)),\"\")","v":"Get-CsCallParkOrbit"},"Gets the call park orbit range settings for the organization.","yes","no","yes","no","no","no","yes","no","yes","yes","Get-CsAdminRole | ? {$_.Cmdlets –match \"Get-CsCallParkOrbit\"}"]
["Get-CsCdrConfiguration","Get-CsCdrConfiguration",{"$f":"IF(ISTEXT(A60),(HYPERLINK(SUBSTITUTE(HLINK(A60),\".aspx\",\"\")&IF(C$1=2013,\"(v=ocs.15).aspx\",\"(v=ocs.14).aspx\"),A60)),\"\")","v":"Get-CsCdrConfiguration"},{"$f":"IF(ISTEXT(B60),(HYPERLINK(SUBSTITUTE(HLINK(B60),\".aspx\",\"\")&IF(D$1=2013,\"(v=ocs.15).aspx\",\"(v=ocs.14).aspx\"),B60)),\"\")","v":"Get-CsCdrConfiguration"},"Returns information about your call detail recording (CDR) settings. CDR enables you to track usage of such things as peer-to-peer instant messaging sessions, Voice over Internet Protocol (VoIP) phone calls, and conferencing calls.","yes","no","yes","no","no","no","yes","no","yes","no","Get-CsAdminRole | ? {$_.Cmdlets –match \"Get-CsCdrConfiguration\"}"]
["Get-CsCertificate","Get-CsCertificate",{"$f":"IF(ISTEXT(A61),(HYPERLINK(SUBSTITUTE(HLINK(A61),\".aspx\",\"\")&IF(C$1=2013,\"(v=ocs.15).aspx\",\"(v=ocs.14).aspx\"),A61)),\"\")","v":"Get-CsCertificate"},{"$f":"IF(ISTEXT(B61),(HYPERLINK(SUBSTITUTE(HLINK(B61),\".aspx\",\"\")&IF(D$1=2013,\"(v=ocs.15).aspx\",\"(v=ocs.14).aspx\"),B61)),\"\")","v":"Get-CsCertificate"},"Returns information about certificates on the local computers that have been configured for use with Microsoft Lync Server 2010.","yes","no","no","no","no","no","yes","no","yes","no","Get-CsAdminRole | ? {$_.Cmdlets –match \"Get-CsCertificate\"}"]
[null,"Get-CsClientAccessLicense",{"$f":"IF(ISTEXT(A62),(HYPERLINK(SUBSTITUTE(HLINK(A62),\".aspx\",\"\")&IF(C$1=2013,\"(v=ocs.15).aspx\",\"(v=ocs.14).aspx\"),A62)),\"\")","v":""},{"$f":"IF(ISTEXT(B62),(HYPERLINK(SUBSTITUTE(HLINK(B62),\".aspx\",\"\")&IF(D$1=2013,\"(v=ocs.15).aspx\",\"(v=ocs.14).aspx\"),B62)),\"\")","v":"Get-CsClientAccessLicense"},"Returns information about client license usage in your organization. This cmdlet was introduced in Lync Server 2013.","yes","no","no","no","no","no","yes","no","yes","no","Get-CsAdminRole | ? {$_.Cmdlets –match \"Get-CsClientAccessLicense\"}"]
["Get-CsClientCertificate","Get-CsClientCertificate",{"$f":"IF(ISTEXT(A63),(HYPERLINK(SUBSTITUTE(HLINK(A63),\".aspx\",\"\")&IF(C$1=2013,\"(v=ocs.15).aspx\",\"(v=ocs.14).aspx\"),A63)),\"\")","v":"Get-CsClientCertificate"},{"$f":"IF(ISTEXT(B63),(HYPERLINK(SUBSTITUTE(HLINK(B63),\".aspx\",\"\")&IF(D$1=2013,\"(v=ocs.15).aspx\",\"(v=ocs.14).aspx\"),B63)),\"\")","v":"Get-CsClientCertificate"},"Returns information about the client certificates that have been issued to a user.","yes","no","no","no","no","no","yes","no","yes","no","Get-CsAdminRole | ? {$_.Cmdlets –match \"Get-CsClientCertificate\"}"]
["Get-CsClientPinInfo","Get-CsClientPinInfo",{"$f":"IF(ISTEXT(A64),(HYPERLINK(SUBSTITUTE(HLINK(A64),\".aspx\",\"\")&IF(C$1=2013,\"(v=ocs.15).aspx\",\"(v=ocs.14).aspx\"),A64)),\"\")","v":"Get-CsClientPinInfo"},{"$f":"IF(ISTEXT(B64),(HYPERLINK(SUBSTITUTE(HLINK(B64),\".aspx\",\"\")&IF(D$1=2013,\"(v=ocs.15).aspx\",\"(v=ocs.14).aspx\"),B64)),\"\")","v":"Get-CsClientPinInfo"},"Retrieves information about the personal identification number (PIN) assigned to a user.","yes","no","yes","no","no","no","yes","yes","yes","yes","Get-CsAdminRole | ? {$_.Cmdlets –match \"Get-CsClientPinInfo\"}"]
["Get-CsClientPolicy","Get-CsClientPolicy",{"$f":"IF(ISTEXT(A65),(HYPERLINK(SUBSTITUTE(HLINK(A65),\".aspx\",\"\")&IF(C$1=2013,\"(v=ocs.15).aspx\",\"(v=ocs.14).aspx\"),A65)),\"\")","v":"Get-CsClientPolicy"},{"$f":"IF(ISTEXT(B65),(HYPERLINK(SUBSTITUTE(HLINK(B65),\".aspx\",\"\")&IF(D$1=2013,\"(v=ocs.15).aspx\",\"(v=ocs.14).aspx\"),B65)),\"\")","v":"Get-CsClientPolicy"},"Returns information about the client policies configured for use in your organization. Among other things, client policies help determine the features of Microsoft Lync 2010 that are available to users; for example, you might give some users the right to transfer files while denying this right to other users.","yes","no","yes","no","no","no","yes","yes","yes","no","Get-CsAdminRole | ? {$_.Cmdlets –match \"Get-CsClientPolicy\"}"]
["Get-CsClientVersionConfiguration","Get-CsClientVersionConfiguration",{"$f":"IF(ISTEXT(A66),(HYPERLINK(SUBSTITUTE(HLINK(A66),\".aspx\",\"\")&IF(C$1=2013,\"(v=ocs.15).aspx\",\"(v=ocs.14).aspx\"),A66)),\"\")","v":"Get-CsClientVersionConfiguration"},{"$f":"IF(ISTEXT(B66),(HYPERLINK(SUBSTITUTE(HLINK(B66),\".aspx\",\"\")&IF(D$1=2013,\"(v=ocs.15).aspx\",\"(v=ocs.14).aspx\"),B66)),\"\")","v":"Get-CsClientVersionConfiguration"},"Retrieves information about the specified collection of client version configuration settings in use in your organization. Client version configuration settings determine whether or not Microsoft Lync Server 2010 checks the version number of each client application that logs on to the system. If client version filtering is enabled the ability of that client application to access the system will be based on settings configured in the relevant client version policy.","yes","no","yes","no","no","no","yes","yes","yes","no","Get-CsAdminRole | ? {$_.Cmdlets –match \"Get-CsClientVersionConfiguration\"}"]
["Get-CsClientVersionPolicy","Get-CsClientVersionPolicy",{"$f":"IF(ISTEXT(A67),(HYPERLINK(SUBSTITUTE(HLINK(A67),\".aspx\",\"\")&IF(C$1=2013,\"(v=ocs.15).aspx\",\"(v=ocs.14).aspx\"),A67)),\"\")","v":"Get-CsClientVersionPolicy"},{"$f":"IF(ISTEXT(B67),(HYPERLINK(SUBSTITUTE(HLINK(B67),\".aspx\",\"\")&IF(D$1=2013,\"(v=ocs.15).aspx\",\"(v=ocs.14).aspx\"),B67)),\"\")","v":"Get-CsClientVersionPolicy"},"Returns information about which clients (such as Microsoft Office Communicator 2007 R2) are supported in your Microsoft Lync Server 2010 environment. Client version policies enable you to specify which clients (such as Office Communicator 2007 R2) will be able to log on to your Lync Server 2010 system.","yes","no","yes","no","no","no","yes","yes","yes","no","Get-CsAdminRole | ? {$_.Cmdlets –match \"Get-CsClientVersionPolicy\"}"]
["Get-CsClientVersionPolicyRule","Get-CsClientVersionPolicyRule",{"$f":"IF(ISTEXT(A68),(HYPERLINK(SUBSTITUTE(HLINK(A68),\".aspx\",\"\")&IF(C$1=2013,\"(v=ocs.15).aspx\",\"(v=ocs.14).aspx\"),A68)),\"\")","v":"Get-CsClientVersionPolicyRule"},{"$f":"IF(ISTEXT(B68),(HYPERLINK(SUBSTITUTE(HLINK(B68),\".aspx\",\"\")&IF(D$1=2013,\"(v=ocs.15).aspx\",\"(v=ocs.14).aspx\"),B68)),\"\")","v":"Get-CsClientVersionPolicyRule"},"Returns the client version policy rules configured for use in your organization.","yes","no","yes","no","no","no","yes","no","yes","no","Get-CsAdminRole | ? {$_.Cmdlets –match \"Get-CsClientVersionPolicyRule\"}"]
[null,"Get-CsClsConfiguration",{"$f":"IF(ISTEXT(A69),(HYPERLINK(SUBSTITUTE(HLINK(A69),\".aspx\",\"\")&IF(C$1=2013,\"(v=ocs.15).aspx\",\"(v=ocs.14).aspx\"),A69)),\"\")","v":""},{"$f":"IF(ISTEXT(B69),(HYPERLINK(SUBSTITUTE(HLINK(B69),\".aspx\",\"\")&IF(D$1=2013,\"(v=ocs.15).aspx\",\"(v=ocs.14).aspx\"),B69)),\"\")","v":"Get-CsClsConfiguration"},"Returns information about the centralized logging configuration settings in use in the organization. Centralized logging provides a way for administrators to simultaneously enable or disable event tracing on multiple computers. This cmdlet was introduced in Lync Server 2013.","yes","no","no","no","no","no","yes","no","yes","no","Get-CsAdminRole | ? {$_.Cmdlets –match \"Get-CsClsConfiguration\"}"]
[null,"Get-CsClsRegion",{"$f":"IF(ISTEXT(A70),(HYPERLINK(SUBSTITUTE(HLINK(A70),\".aspx\",\"\")&IF(C$1=2013,\"(v=ocs.15).aspx\",\"(v=ocs.14).aspx\"),A70)),\"\")","v":""},{"$f":"IF(ISTEXT(B70),(HYPERLINK(SUBSTITUTE(HLINK(B70),\".aspx\",\"\")&IF(D$1=2013,\"(v=ocs.15).aspx\",\"(v=ocs.14).aspx\"),B70)),\"\")","v":"Get-CsClsRegion"},"Returns information about the centralized logging configuration regions in use in the organization. Centralized logging provides a way for administrators to simultaneously enable or disable event tracing on multiple computers. Centralized logging regions are intended for use with Lync Online. This cmdlet was introduced in Lync Server 2013.","yes","no","no","no","no","no","yes","no","yes","no","Get-CsAdminRole | ? {$_.Cmdlets –match \"Get-CsClsRegion\"}"]
[null,"Get-CsClsSearchTerm",{"$f":"IF(ISTEXT(A71),(HYPERLINK(SUBSTITUTE(HLINK(A71),\".aspx\",\"\")&IF(C$1=2013,\"(v=ocs.15).aspx\",\"(v=ocs.14).aspx\"),A71)),\"\")","v":""},{"$f":"IF(ISTEXT(B71),(HYPERLINK(SUBSTITUTE(HLINK(B71),\".aspx\",\"\")&IF(D$1=2013,\"(v=ocs.15).aspx\",\"(v=ocs.14).aspx\"),B71)),\"\")","v":"Get-CsClsSearchTerm"},"Returns information about the centralized logging search terms available for use in the organization. Search terms help define the personally identifiable information available to technical support personnel who are searching the centralized trace logs. Search terms are intended for use with Lync Online. This cmdlet was introduced in Lync Server 2013.","yes","no","no","no","no","no","yes","no","yes","no",{"$f":"\"Get-CsAdminRole | ? {$_.Cmdlets –match \"& CHAR(34) &B71& CHAR(34) &\"}\"","v":"Get-CsAdminRole | ? {$_.Cmdlets –match \"Get-CsClsSearchTerm\"}"}]
[null,"Get-CsClsScenario",{"$f":"IF(ISTEXT(A72),(HYPERLINK(SUBSTITUTE(HLINK(A72),\".aspx\",\"\")&IF(C$1=2013,\"(v=ocs.15).aspx\",\"(v=ocs.14).aspx\"),A72)),\"\")","v":""},{"$f":"IF(ISTEXT(B72),(HYPERLINK(SUBSTITUTE(HLINK(B72),\".aspx\",\"\")&IF(D$1=2013,\"(v=ocs.15).aspx\",\"(v=ocs.14).aspx\"),B72)),\"\")","v":"Get-CsClsScenario"},"Returns information for one or more centralized logging configuration scenarios. A scenario represents a particular Lync Server 2013 component or situation (such as IM and presence) that administrators can enable or disable for tracing. This cmdlet was introduced in Lync Server 2013.","yes","no","no","no","no","no","yes","no","yes","no",{"$f":"\"Get-CsAdminRole | ? {$_.Cmdlets –match \"& CHAR(34) &B72& CHAR(34) &\"}\"","v":"Get-CsAdminRole | ? {$_.Cmdlets –match \"Get-CsClsScenario\"}"}]
[null,"Get-CsClsSecurityGroup",{"$f":"IF(ISTEXT(A73),(HYPERLINK(SUBSTITUTE(HLINK(A73),\".aspx\",\"\")&IF(C$1=2013,\"(v=ocs.15).aspx\",\"(v=ocs.14).aspx\"),A73)),\"\")","v":""},{"$f":"IF(ISTEXT(B73),(HYPERLINK(SUBSTITUTE(HLINK(B73),\".aspx\",\"\")&IF(D$1=2013,\"(v=ocs.15).aspx\",\"(v=ocs.14).aspx\"),B73)),\"\")","v":"Get-CsClsSecurityGroup"},"Returns information about the centralized logging configuration security groups in use in the organization. Centralized logging provides a way for administrators to simultaneously enable or disable event tracing on multiple computers. Security groups are intended for use with Lync Online. This cmdlet was introduced in Lync Server 2013.","yes","no","no","no","no","no","yes","no","yes","no","Get-CsAdminRole | ? {$_.Cmdlets –match \"Get-CsClsSecurityGroup\"}"]
["Get-CsCommonAreaPhone","Get-CsCommonAreaPhone",{"$f":"IF(ISTEXT(A74),(HYPERLINK(SUBSTITUTE(HLINK(A74),\".aspx\",\"\")&IF(C$1=2013,\"(v=ocs.15).aspx\",\"(v=ocs.14).aspx\"),A74)),\"\")","v":"Get-CsCommonAreaPhone"},{"$f":"IF(ISTEXT(B74),(HYPERLINK(SUBSTITUTE(HLINK(B74),\".aspx\",\"\")&IF(D$1=2013,\"(v=ocs.15).aspx\",\"(v=ocs.14).aspx\"),B74)),\"\")","v":"Get-CsCommonAreaPhone"},"Returns information about the common area phones managed by using Microsoft Lync Server 2010. Common area phones are phones that are located in building lobbies, employee lounges, or other areas where they are likely to be used by a number of different people and for a number of different uses.","yes","no","yes","no","no","no","yes","yes","yes","yes","Get-CsAdminRole | ? {$_.Cmdlets –match \"Get-CsCommonAreaPhone\"}"]
["Get-CsComputer","Get-CsComputer",{"$f":"IF(ISTEXT(A75),(HYPERLINK(SUBSTITUTE(HLINK(A75),\".aspx\",\"\")&IF(C$1=2013,\"(v=ocs.15).aspx\",\"(v=ocs.14).aspx\"),A75)),\"\")","v":"Get-CsComputer"},{"$f":"IF(ISTEXT(B75),(HYPERLINK(SUBSTITUTE(HLINK(B75),\".aspx\",\"\")&IF(D$1=2013,\"(v=ocs.15).aspx\",\"(v=ocs.14).aspx\"),B75)),\"\")","v":"Get-CsComputer"},"Returns information about the computers that perform service roles within your Microsoft Lync Server 2010 infrastructure.","yes","yes","yes","yes","no","yes","yes","yes","yes","yes","Get-CsAdminRole | ? {$_.Cmdlets –match \"Get-CsComputer\"}"]
["Get-CsConferenceDirectory","Get-CsConferenceDirectory",{"$f":"IF(ISTEXT(A76),(HYPERLINK(SUBSTITUTE(HLINK(A76),\".aspx\",\"\")&IF(C$1=2013,\"(v=ocs.15).aspx\",\"(v=ocs.14).aspx\"),A76)),\"\")","v":"Get-CsConferenceDirectory"},{"$f":"IF(ISTEXT(B76),(HYPERLINK(SUBSTITUTE(HLINK(B76),\".aspx\",\"\")&IF(D$1=2013,\"(v=ocs.15).aspx\",\"(v=ocs.14).aspx\"),B76)),\"\")","v":"Get-CsConferenceDirectory"},"Returns information about the conference directories configured for use in your organization. Conference directories are used to help dial-in conferencing users locate conference information.","yes","no","yes","no","no","no","yes","no","yes","no","Get-CsAdminRole | ? {$_.Cmdlets –match \"Get-CsConferenceDirectory\"}"]
["Get-CsConferenceDisclaimer","Get-CsConferenceDisclaimer",{"$f":"IF(ISTEXT(A77),(HYPERLINK(SUBSTITUTE(HLINK(A77),\".aspx\",\"\")&IF(C$1=2013,\"(v=ocs.15).aspx\",\"(v=ocs.14).aspx\"),A77)),\"\")","v":"Get-CsConferenceDisclaimer"},{"$f":"IF(ISTEXT(B77),(HYPERLINK(SUBSTITUTE(HLINK(B77),\".aspx\",\"\")&IF(D$1=2013,\"(v=ocs.15).aspx\",\"(v=ocs.14).aspx\"),B77)),\"\")","v":"Get-CsConferenceDisclaimer"},"Returns information about the conference disclaimer used in your organization. The conference disclaimer is a message that is displayed to users who join the conference by using a hyperlink (for example, users who paste a link to the conference into a browser such as Windows Internet Explorer).","yes","no","yes","no","no","no","yes","no","yes","no","Get-CsAdminRole | ? {$_.Cmdlets –match \"Get-CsConferenceDisclaimer\"}"]
["Get-CsConferencingConfiguration","Get-CsConferencingConfiguration",{"$f":"IF(ISTEXT(A78),(HYPERLINK(SUBSTITUTE(HLINK(A78),\".aspx\",\"\")&IF(C$1=2013,\"(v=ocs.15).aspx\",\"(v=ocs.14).aspx\"),A78)),\"\")","v":"Get-CsConferencingConfiguration"},{"$f":"IF(ISTEXT(B78),(HYPERLINK(SUBSTITUTE(HLINK(B78),\".aspx\",\"\")&IF(D$1=2013,\"(v=ocs.15).aspx\",\"(v=ocs.14).aspx\"),B78)),\"\")","v":"Get-CsConferencingConfiguration"},"Returns information about the conference configuration settings for your organization. Conference settings determine such things as the maximum-allowed size for conference content and handouts, the content grace period (that is, the amount of time content will be stored before being deleted), and the URLs for the internal and external downloads of the supported client.","yes","no","yes","no","no","no","yes","no","yes","no","Get-CsAdminRole | ? {$_.Cmdlets –match \"Get-CsConferencingConfiguration\"}"]
["Get-CsConferencingPolicy","Get-CsConferencingPolicy",{"$f":"IF(ISTEXT(A79),(HYPERLINK(SUBSTITUTE(HLINK(A79),\".aspx\",\"\")&IF(C$1=2013,\"(v=ocs.15).aspx\",\"(v=ocs.14).aspx\"),A79)),\"\")","v":"Get-CsConferencingPolicy"},{"$f":"IF(ISTEXT(B79),(HYPERLINK(SUBSTITUTE(HLINK(B79),\".aspx\",\"\")&IF(D$1=2013,\"(v=ocs.15).aspx\",\"(v=ocs.14).aspx\"),B79)),\"\")","v":"Get-CsConferencingPolicy"},"Returns information about the conferencing policies that have been configured for use in your organization. Conferencing policies determine the features and capabilities that can be used in a conference; this includes everything from whether or not the conference can include IP audio and video to the maximum number of people who can attend a meeting.","yes","no","yes","no","no","no","yes","yes","yes","no","Get-CsAdminRole | ? {$_.Cmdlets –match \"Get-CsConferencingPolicy\"}"]
["Get-CsConfigurationStoreLocation","Get-CsConfigurationStoreLocation",{"$f":"IF(ISTEXT(A80),(HYPERLINK(SUBSTITUTE(HLINK(A80),\".aspx\",\"\")&IF(C$1=2013,\"(v=ocs.15).aspx\",\"(v=ocs.14).aspx\"),A80)),\"\")","v":"Get-CsConfigurationStoreLocation"},{"$f":"IF(ISTEXT(B80),(HYPERLINK(SUBSTITUTE(HLINK(B80),\".aspx\",\"\")&IF(D$1=2013,\"(v=ocs.15).aspx\",\"(v=ocs.14).aspx\"),B80)),\"\")","v":"Get-CsConfigurationStoreLocation"},"Reports back the location of the Active Directory service control point for the Central Management store.","no","no","no","no","no","no","no","no","no","no","Get-CsAdminRole | ? {$_.Cmdlets –match \"Get-CsConfigurationStoreLocation\"}"]
["Get-CsCpsConfiguration","Get-CsCpsConfiguration",{"$f":"IF(ISTEXT(A81),(HYPERLINK(SUBSTITUTE(HLINK(A81),\".aspx\",\"\")&IF(C$1=2013,\"(v=ocs.15).aspx\",\"(v=ocs.14).aspx\"),A81)),\"\")","v":"Get-CsCpsConfiguration"},{"$f":"IF(ISTEXT(B81),(HYPERLINK(SUBSTITUTE(HLINK(B81),\".aspx\",\"\")&IF(D$1=2013,\"(v=ocs.15).aspx\",\"(v=ocs.14).aspx\"),B81)),\"\")","v":"Get-CsCpsConfiguration"},"Returns information about the Call Park service. Call parking is a service that allows a user to \"park\" an incoming phone call. Parking a call transfers it to a number in a specified range, or orbit, and then immediately places the call on hold. Anyone (not just the person who originally answered the call) can resume the conversation from any telephone in the system by entering the correct number.","yes","no","yes","no","no","no","yes","no","yes","yes","Get-CsAdminRole | ? {$_.Cmdlets –match \"Get-CsCpsConfiguration\"}"]
[null,"Get-CsDatabaseMirrorState",{"$f":"IF(ISTEXT(A82),(HYPERLINK(SUBSTITUTE(HLINK(A82),\".aspx\",\"\")&IF(C$1=2013,\"(v=ocs.15).aspx\",\"(v=ocs.14).aspx\"),A82)),\"\")","v":""},{"$f":"IF(ISTEXT(B82),(HYPERLINK(SUBSTITUTE(HLINK(B82),\".aspx\",\"\")&IF(D$1=2013,\"(v=ocs.15).aspx\",\"(v=ocs.14).aspx\"),B82)),\"\")","v":"Get-CsDatabaseMirrorState"},"Returns information about whether database mirroring has been implemented for a specified database on a specified pool. Database mirroring enables you to simultaneously maintain two copies of a database, with each copy residing on a different server. This cmdlet was introduced in Lync Server 2013.","yes","no","no","no","no","no","yes","no","yes","no","Get-CsAdminRole | ? {$_.Cmdlets –match \"Get-CsDatabaseMirrorState\"}"]
["Get-CsDeviceUpdateConfiguration","Get-CsDeviceUpdateConfiguration",{"$f":"IF(ISTEXT(A83),(HYPERLINK(SUBSTITUTE(HLINK(A83),\".aspx\",\"\")&IF(C$1=2013,\"(v=ocs.15).aspx\",\"(v=ocs.14).aspx\"),A83)),\"\")","v":"Get-CsDeviceUpdateConfiguration"},{"$f":"IF(ISTEXT(B83),(HYPERLINK(SUBSTITUTE(HLINK(B83),\".aspx\",\"\")&IF(D$1=2013,\"(v=ocs.15).aspx\",\"(v=ocs.14).aspx\"),B83)),\"\")","v":"Get-CsDeviceUpdateConfiguration"},"Returns information about the device update configuration settings currently deployed in your organization. These settings help manage the Device Update Web service, a Microsoft Lync Server 2010 component that enables administrators to distribute firmware updates to telephones and other devices running Microsoft Lync 2010 Phone Edition.","yes","no","yes","no","no","no","yes","no","yes","yes","Get-CsAdminRole | ? {$_.Cmdlets –match \"Get-CsDeviceUpdateConfiguration\"}"]
["Get-CsDeviceUpdateRule","Get-CsDeviceUpdateRule",{"$f":"IF(ISTEXT(A84),(HYPERLINK(SUBSTITUTE(HLINK(A84),\".aspx\",\"\")&IF(C$1=2013,\"(v=ocs.15).aspx\",\"(v=ocs.14).aspx\"),A84)),\"\")","v":"Get-CsDeviceUpdateRule"},{"$f":"IF(ISTEXT(B84),(HYPERLINK(SUBSTITUTE(HLINK(B84),\".aspx\",\"\")&IF(D$1=2013,\"(v=ocs.15).aspx\",\"(v=ocs.14).aspx\"),B84)),\"\")","v":"Get-CsDeviceUpdateRule"},"Returns information about the device update rules configured for use in your organization. Device update rules are used to associate firmware updates with devices that run Microsoft Lync 2010 Phone Edition.","yes","no","yes","no","no","no","yes","no","yes","yes","Get-CsAdminRole | ? {$_.Cmdlets –match \"Get-CsDeviceUpdateRule\"}"]
["Get-CsDiagnosticConfiguration","Get-CsDiagnosticConfiguration",{"$f":"IF(ISTEXT(A85),(HYPERLINK(SUBSTITUTE(HLINK(A85),\".aspx\",\"\")&IF(C$1=2013,\"(v=ocs.15).aspx\",\"(v=ocs.14).aspx\"),A85)),\"\")","v":"Get-CsDiagnosticConfiguration"},{"$f":"IF(ISTEXT(B85),(HYPERLINK(SUBSTITUTE(HLINK(B85),\".aspx\",\"\")&IF(D$1=2013,\"(v=ocs.15).aspx\",\"(v=ocs.14).aspx\"),B85)),\"\")","v":"Get-CsDiagnosticConfiguration"},"Returns information about the diagnostic configuration settings currently in use in your organization. Diagnostic configuration settings are used to determine whether traffic to or from a given domain or Uniform Resource Identifier (URI) is recorded in your Microsoft Lync Server 2010 log files.","yes","no","yes","no","no","no","yes","no","yes","no","Get-CsAdminRole | ? {$_.Cmdlets –match \"Get-CsDiagnosticConfiguration\"}"]
["Get-CsDiagnosticHeaderConfiguration","Get-CsDiagnosticHeaderConfiguration",{"$f":"IF(ISTEXT(A86),(HYPERLINK(SUBSTITUTE(HLINK(A86),\".aspx\",\"\")&IF(C$1=2013,\"(v=ocs.15).aspx\",\"(v=ocs.14).aspx\"),A86)),\"\")","v":"Get-CsDiagnosticHeaderConfiguration"},{"$f":"IF(ISTEXT(B86),(HYPERLINK(SUBSTITUTE(HLINK(B86),\".aspx\",\"\")&IF(D$1=2013,\"(v=ocs.15).aspx\",\"(v=ocs.14).aspx\"),B86)),\"\")","v":"Get-CsDiagnosticHeaderConfiguration"},"Returns information about the diagnostic header configuration settings currently in use in your organization. Diagnostic header configuration settings determine whether SIP messages are accompanied by header information. This information can be useful in troubleshooting and error reporting.","yes","no","yes","no","no","no","yes","no","yes","no","Get-CsAdminRole | ? {$_.Cmdlets –match \"Get-CsDiagnosticHeaderConfiguration\"}"]
["Get-CsDialInConferencingAccessNumber","Get-CsDialInConferencingAccessNumber",{"$f":"IF(ISTEXT(A87),(HYPERLINK(SUBSTITUTE(HLINK(A87),\".aspx\",\"\")&IF(C$1=2013,\"(v=ocs.15).aspx\",\"(v=ocs.14).aspx\"),A87)),\"\")","v":"Get-CsDialInConferencingAccessNumber"},{"$f":"IF(ISTEXT(B87),(HYPERLINK(SUBSTITUTE(HLINK(B87),\".aspx\",\"\")&IF(D$1=2013,\"(v=ocs.15).aspx\",\"(v=ocs.14).aspx\"),B87)),\"\")","v":"Get-CsDialInConferencingAccessNumber"},"Returns information about all the dial-in conferencing access numbers configured for use in your organization. Dial-in conferencing provides a way for users to use a \"regular\" telephone mobile phone, or device on the public switched telephone network (PSTN) to join the audio portion of an online conference.","yes","no","yes","no","no","no","yes","no","yes","no","Get-CsAdminRole | ? {$_.Cmdlets –match \"Get-CsDialInConferencingAccessNumber\"}"]
["Get-CsDialInConferencingConfiguration","Get-CsDialInConferencingConfiguration",{"$f":"IF(ISTEXT(A88),(HYPERLINK(SUBSTITUTE(HLINK(A88),\".aspx\",\"\")&IF(C$1=2013,\"(v=ocs.15).aspx\",\"(v=ocs.14).aspx\"),A88)),\"\")","v":"Get-CsDialInConferencingConfiguration"},{"$f":"IF(ISTEXT(B88),(HYPERLINK(SUBSTITUTE(HLINK(B88),\".aspx\",\"\")&IF(D$1=2013,\"(v=ocs.15).aspx\",\"(v=ocs.14).aspx\"),B88)),\"\")","v":"Get-CsDialInConferencingConfiguration"},"Retrieves information about how Microsoft Lync Server 2010 responds when users join or leave a dial-in conference.","yes","no","yes","no","no","no","yes","no","yes","no","Get-CsAdminRole | ? {$_.Cmdlets –match \"Get-CsDialInConferencingConfiguration\"}"]
["Get-CsDialInConferencingDtmfConfiguration","Get-CsDialInConferencingDtmfConfiguration",{"$f":"IF(ISTEXT(A89),(HYPERLINK(SUBSTITUTE(HLINK(A89),\".aspx\",\"\")&IF(C$1=2013,\"(v=ocs.15).aspx\",\"(v=ocs.14).aspx\"),A89)),\"\")","v":"Get-CsDialInConferencingDtmfConfiguration"},{"$f":"IF(ISTEXT(B89),(HYPERLINK(SUBSTITUTE(HLINK(B89),\".aspx\",\"\")&IF(D$1=2013,\"(v=ocs.15).aspx\",\"(v=ocs.14).aspx\"),B89)),\"\")","v":"Get-CsDialInConferencingDtmfConfiguration"},"Returns the dual-tone multifrequency (DTMF) signaling settings used for dial-in conferencing. DTMF enables users who dial in to a conference to control conference settings (such as muting and unmuting themselves or locking and unlocking the conference) by using the keypad on their telephone.","yes","no","yes","no","no","no","yes","no","yes","no","Get-CsAdminRole | ? {$_.Cmdlets –match \"Get-CsDialInConferencingDtmfConfiguration\"}"]
["Get-CsDialInConferencingLanguageList","Get-CsDialInConferencingLanguageList",{"$f":"IF(ISTEXT(A90),(HYPERLINK(SUBSTITUTE(HLINK(A90),\".aspx\",\"\")&IF(C$1=2013,\"(v=ocs.15).aspx\",\"(v=ocs.14).aspx\"),A90)),\"\")","v":"Get-CsDialInConferencingLanguageList"},{"$f":"IF(ISTEXT(B90),(HYPERLINK(SUBSTITUTE(HLINK(B90),\".aspx\",\"\")&IF(D$1=2013,\"(v=ocs.15).aspx\",\"(v=ocs.14).aspx\"),B90)),\"\")","v":"Get-CsDialInConferencingLanguageList"},"Returns a list of languages and dialects supported for use with Microsoft Lync Server 2010 dial-in conferences. These languages are used to relay audio messages and instructions to users participating in a conference by using a telephone.","yes","no","yes","no","no","no","yes","no","yes","no","Get-CsAdminRole | ? {$_.Cmdlets –match \"Get-CsDialInConferencingLanguageList\"}"]
["Get-CsDialPlan","Get-CsDialPlan",{"$f":"IF(ISTEXT(A91),(HYPERLINK(SUBSTITUTE(HLINK(A91),\".aspx\",\"\")&IF(C$1=2013,\"(v=ocs.15).aspx\",\"(v=ocs.14).aspx\"),A91)),\"\")","v":"Get-CsDialPlan"},{"$f":"IF(ISTEXT(B91),(HYPERLINK(SUBSTITUTE(HLINK(B91),\".aspx\",\"\")&IF(D$1=2013,\"(v=ocs.15).aspx\",\"(v=ocs.14).aspx\"),B91)),\"\")","v":"Get-CsDialPlan"},"Returns information about the dial plans used in your organization.","yes","no","yes","no","no","no","yes","yes","yes","yes","Get-CsAdminRole | ? {$_.Cmdlets –match \"Get-CsDialPlan\"}"]
[null,"Get-CsEffectivePolicy",{"$f":"IF(ISTEXT(A92),(HYPERLINK(SUBSTITUTE(HLINK(A92),\".aspx\",\"\")&IF(C$1=2013,\"(v=ocs.15).aspx\",\"(v=ocs.14).aspx\"),A92)),\"\")","v":""},{"$f":"IF(ISTEXT(B92),(HYPERLINK(SUBSTITUTE(HLINK(B92),\".aspx\",\"\")&IF(D$1=2013,\"(v=ocs.15).aspx\",\"(v=ocs.14).aspx\"),B92)),\"\")","v":"Get-CsEffectivePolicy"},"Returns the \"effective policies\" for the specified user or users. This simply means that, if a user has been a per-user policy, the Identity of that policy will be displayed. If a user has not been assigned a per-user policy, then the Get-CsEffectivePolicy cmdlet will indicate whether the user is managed by a service policy, a site policy, or the global policy. This enables you to determine exactly which policy is being used to manage a given user. This cmdlet was introduced in Lync Server 2013.","yes","no","no","no","no","no","yes","no","yes","no","Get-CsAdminRole | ? {$_.Cmdlets –match \"Get-CsEffectivePolicy\"}"]
["Get-CsEnhancedEmergencyServiceDisclaimer","Get-CsEnhancedEmergencyServiceDisclaimer",{"$f":"IF(ISTEXT(A93),(HYPERLINK(SUBSTITUTE(HLINK(A93),\".aspx\",\"\")&IF(C$1=2013,\"(v=ocs.15).aspx\",\"(v=ocs.14).aspx\"),A93)),\"\")","v":"Get-CsEnhancedEmergencyServiceDisclaimer"},{"$f":"IF(ISTEXT(B93),(HYPERLINK(SUBSTITUTE(HLINK(B93),\".aspx\",\"\")&IF(D$1=2013,\"(v=ocs.15).aspx\",\"(v=ocs.14).aspx\"),B93)),\"\")","v":"Get-CsEnhancedEmergencyServiceDisclaimer"},"Retrieves the disclaimer text that is used globally to prompt for location information for an Enhanced 9-1-1 (E9-1-1) implementation.","yes","no","yes","no","no","no","yes","no","yes","yes","Get-CsAdminRole | ? {$_.Cmdlets –match \"Get-CsEnhancedEmergencyServiceDisclaimer\"}"]
["Get-CsExternalAccessPolicy","Get-CsExternalAccessPolicy",{"$f":"IF(ISTEXT(A94),(HYPERLINK(SUBSTITUTE(HLINK(A94),\".aspx\",\"\")&IF(C$1=2013,\"(v=ocs.15).aspx\",\"(v=ocs.14).aspx\"),A94)),\"\")","v":"Get-CsExternalAccessPolicy"},{"$f":"IF(ISTEXT(B94),(HYPERLINK(SUBSTITUTE(HLINK(B94),\".aspx\",\"\")&IF(D$1=2013,\"(v=ocs.15).aspx\",\"(v=ocs.14).aspx\"),B94)),\"\")","v":"Get-CsExternalAccessPolicy"},"Returns information about the external access policies that have been configured for use in your organization. External access policies determine whether or not your users can: 1) communicate with users who have Session Initiation Protocol (SIP) accounts with a federated organization; 2) communicate with users who have SIP accounts with a public instant messaging (IM) provider such as Windows Live; and, 3) access Microsoft Lync Server 2010 over the Internet, without having to log on to your internal network.","yes","no","yes","no","no","no","yes","yes","yes","no","Get-CsAdminRole | ? {$_.Cmdlets –match \"Get-CsExternalAccessPolicy\"}"]
["Get-CsExUmContact","Get-CsExUmContact",{"$f":"IF(ISTEXT(A95),(HYPERLINK(SUBSTITUTE(HLINK(A95),\".aspx\",\"\")&IF(C$1=2013,\"(v=ocs.15).aspx\",\"(v=ocs.14).aspx\"),A95)),\"\")","v":"Get-CsExUmContact"},{"$f":"IF(ISTEXT(B95),(HYPERLINK(SUBSTITUTE(HLINK(B95),\".aspx\",\"\")&IF(D$1=2013,\"(v=ocs.15).aspx\",\"(v=ocs.14).aspx\"),B95)),\"\")","v":"Get-CsExUmContact"},"Retrieves one or more hosted Exchange Unified Messaging (UM) contact objects.","yes","no","yes","no","no","no","yes","yes","yes","yes","Get-CsAdminRole | ? {$_.Cmdlets –match \"Get-CsExUmContact\"}"]
["Get-CsFileTransferFilterConfiguration","Get-CsFileTransferFilterConfiguration",{"$f":"IF(ISTEXT(A96),(HYPERLINK(SUBSTITUTE(HLINK(A96),\".aspx\",\"\")&IF(C$1=2013,\"(v=ocs.15).aspx\",\"(v=ocs.14).aspx\"),A96)),\"\")","v":"Get-CsFileTransferFilterConfiguration"},{"$f":"IF(ISTEXT(B96),(HYPERLINK(SUBSTITUTE(HLINK(B96),\".aspx\",\"\")&IF(D$1=2013,\"(v=ocs.15).aspx\",\"(v=ocs.14).aspx\"),B96)),\"\")","v":"Get-CsFileTransferFilterConfiguration"},"Returns the file transfer filter configurations in your organization. These configurations are used to block a user's ability to transfer certain types of files (for example, files with a .vbs or .ps1 file extension) using a Microsoft Lync Server 2010 client.","yes","no","yes","no","no","no","yes","no","yes","no","Get-CsAdminRole | ? {$_.Cmdlets –match \"Get-CsFileTransferFilterConfiguration\"}"]
[null,"Get-CsFIPSConfiguration",{"$f":"IF(ISTEXT(A97),(HYPERLINK(SUBSTITUTE(HLINK(A97),\".aspx\",\"\")&IF(C$1=2013,\"(v=ocs.15).aspx\",\"(v=ocs.14).aspx\"),A97)),\"\")","v":""},{"$f":"IF(ISTEXT(B97),(HYPERLINK(SUBSTITUTE(HLINK(B97),\".aspx\",\"\")&IF(D$1=2013,\"(v=ocs.15).aspx\",\"(v=ocs.14).aspx\"),B97)),\"\")","v":"Get-CsFIPSConfiguration"},"Returns information about the Federal Information Processing Standards (FIPS) configuration settings currently in use in the organization. The FIPS standards are a set of United States government security standards required for use in computers maintained by non-military government agencies and by government contractors. This cmdlet was introduced in Lync Server 2013.","yes","no","no","no","no","no","yes","no","yes","no","Get-CsAdminRole | ? {$_.Cmdlets –match \"Get-CsFIPSConfiguration\"}"]
["Get-CsHealthMonitoringConfiguration","Get-CsHealthMonitoringConfiguration",{"$f":"IF(ISTEXT(A98),(HYPERLINK(SUBSTITUTE(HLINK(A98),\".aspx\",\"\")&IF(C$1=2013,\"(v=ocs.15).aspx\",\"(v=ocs.14).aspx\"),A98)),\"\")","v":"Get-CsHealthMonitoringConfiguration"},{"$f":"IF(ISTEXT(B98),(HYPERLINK(SUBSTITUTE(HLINK(B98),\".aspx\",\"\")&IF(D$1=2013,\"(v=ocs.15).aspx\",\"(v=ocs.14).aspx\"),B98)),\"\")","v":"Get-CsHealthMonitoringConfiguration"},"Returns information about the health monitoring configuration settings currently in use in your organization. These settings enable administrators to run quality assurance tests without having to supply user names and passwords for the required test accounts.","yes","no","yes","no","no","no","yes","no","yes","no","Get-CsAdminRole | ? {$_.Cmdlets –match \"Get-CsHealthMonitoringConfiguration\"}"]
["Get-CsHostedVoicemailPolicy","Get-CsHostedVoicemailPolicy",{"$f":"IF(ISTEXT(A99),(HYPERLINK(SUBSTITUTE(HLINK(A99),\".aspx\",\"\")&IF(C$1=2013,\"(v=ocs.15).aspx\",\"(v=ocs.14).aspx\"),A99)),\"\")","v":"Get-CsHostedVoicemailPolicy"},{"$f":"IF(ISTEXT(B99),(HYPERLINK(SUBSTITUTE(HLINK(B99),\".aspx\",\"\")&IF(D$1=2013,\"(v=ocs.15).aspx\",\"(v=ocs.14).aspx\"),B99)),\"\")","v":"Get-CsHostedVoicemailPolicy"},"Retrieves a hosted voice mail policy.","yes","no","yes","no","no","no","yes","yes","yes","yes","Get-CsAdminRole | ? {$_.Cmdlets –match \"Get-CsHostedVoicemailPolicy\"}"]
["Get-CsHostingProvider","Get-CsHostingProvider",{"$f":"IF(ISTEXT(A100),(HYPERLINK(SUBSTITUTE(HLINK(A100),\".aspx\",\"\")&IF(C$1=2013,\"(v=ocs.15).aspx\",\"(v=ocs.14).aspx\"),A100)),\"\")","v":"Get-CsHostingProvider"},{"$f":"IF(ISTEXT(B100),(HYPERLINK(SUBSTITUTE(HLINK(B100),\".aspx\",\"\")&IF(D$1=2013,\"(v=ocs.15).aspx\",\"(v=ocs.14).aspx\"),B100)),\"\")","v":"Get-CsHostingProvider"},"Returns information about the hosting providers configured for use in your organization. A hosting provider is a third-party organization that provides instant messaging, presence, and related services for a domain that you would like to federate with. Hosting providers, such as Microsoft Lync Online 2010, differ from public providers (such as Yahoo!, MSN, and AOL) in that their services are not offered to the general public.","yes","no","yes","no","no","no","yes","no","yes","no","Get-CsAdminRole | ? {$_.Cmdlets –match \"Get-CsHostingProvider\"}"]
["Get-CsImFilterConfiguration","Get-CsImFilterConfiguration",{"$f":"IF(ISTEXT(A101),(HYPERLINK(SUBSTITUTE(HLINK(A101),\".aspx\",\"\")&IF(C$1=2013,\"(v=ocs.15).aspx\",\"(v=ocs.14).aspx\"),A101)),\"\")","v":"Get-CsImFilterConfiguration"},{"$f":"IF(ISTEXT(B101),(HYPERLINK(SUBSTITUTE(HLINK(B101),\".aspx\",\"\")&IF(D$1=2013,\"(v=ocs.15).aspx\",\"(v=ocs.14).aspx\"),B101)),\"\")","v":"Get-CsImFilterConfiguration"},"Returns the instant messaging (IM) link filters configured in your organization. These filters are used to prevent users from sending instant messages that contain hyperlinks with specific prefixes (for example, links with an http or telnet prefix). Depending on your settings, this means that any Uniform Resource Identifier (URI) prefaced with one of these schemes will be converted to a non-clickable hyperlink or removed altogether.","yes","no","yes","no","no","no","yes","no","yes","no","Get-CsAdminRole | ? {$_.Cmdlets –match \"Get-CsImFilterConfiguration\"}"]
["Get-CsKerberosAccountAssignment","Get-CsKerberosAccountAssignment",{"$f":"IF(ISTEXT(A102),(HYPERLINK(SUBSTITUTE(HLINK(A102),\".aspx\",\"\")&IF(C$1=2013,\"(v=ocs.15).aspx\",\"(v=ocs.14).aspx\"),A102)),\"\")","v":"Get-CsKerberosAccountAssignment"},{"$f":"IF(ISTEXT(B102),(HYPERLINK(SUBSTITUTE(HLINK(B102),\".aspx\",\"\")&IF(D$1=2013,\"(v=ocs.15).aspx\",\"(v=ocs.14).aspx\"),B102)),\"\")","v":"Get-CsKerberosAccountAssignment"},"Returns information about the Kerberos account assignments configured for use in the organization.","no","no","no","no","no","no","no","no","no","no","Get-CsAdminRole | ? {$_.Cmdlets –match \"Get-CsKerberosAccountAssignment\"}"]
["Get-CsLisCivicAddress","Get-CsLisCivicAddress",{"$f":"IF(ISTEXT(A103),(HYPERLINK(SUBSTITUTE(HLINK(A103),\".aspx\",\"\")&IF(C$1=2013,\"(v=ocs.15).aspx\",\"(v=ocs.14).aspx\"),A103)),\"\")","v":"Get-CsLisCivicAddress"},{"$f":"IF(ISTEXT(B103),(HYPERLINK(SUBSTITUTE(HLINK(B103),\".aspx\",\"\")&IF(D$1=2013,\"(v=ocs.15).aspx\",\"(v=ocs.14).aspx\"),B103)),\"\")","v":"Get-CsLisCivicAddress"},"Retrieves only the address portion of one or more locations in the location configuration database for Enhanced 9-1-1 (E9-1-1).","yes","no","yes","yes","no","no","yes","no","yes","yes","Get-CsAdminRole | ? {$_.Cmdlets –match \"Get-CsLisCivicAddress\"}"]
["Get-CsLisLocation","Get-CsLisLocation",{"$f":"IF(ISTEXT(A104),(HYPERLINK(SUBSTITUTE(HLINK(A104),\".aspx\",\"\")&IF(C$1=2013,\"(v=ocs.15).aspx\",\"(v=ocs.14).aspx\"),A104)),\"\")","v":"Get-CsLisLocation"},{"$f":"IF(ISTEXT(B104),(HYPERLINK(SUBSTITUTE(HLINK(B104),\".aspx\",\"\")&IF(D$1=2013,\"(v=ocs.15).aspx\",\"(v=ocs.14).aspx\"),B104)),\"\")","v":"Get-CsLisLocation"},"Retrieves one or more locations in the location configuration database for Enhanced 9-1-1 (E9-1-1).","yes","no","yes","yes","no","no","yes","no","yes","yes","Get-CsAdminRole | ? {$_.Cmdlets –match \"Get-CsLisLocation\"}"]
["Get-CsLisPort","Get-CsLisPort",{"$f":"IF(ISTEXT(A105),(HYPERLINK(SUBSTITUTE(HLINK(A105),\".aspx\",\"\")&IF(C$1=2013,\"(v=ocs.15).aspx\",\"(v=ocs.14).aspx\"),A105)),\"\")","v":"Get-CsLisPort"},{"$f":"IF(ISTEXT(B105),(HYPERLINK(SUBSTITUTE(HLINK(B105),\".aspx\",\"\")&IF(D$1=2013,\"(v=ocs.15).aspx\",\"(v=ocs.14).aspx\"),B105)),\"\")","v":"Get-CsLisPort"},"Retrieves one or more ports from the location configuration database. Each port can be associated with a location, in which case this cmdlet will also retrieve the location information of the ports. This location association is used in an Enhanced 9-1-1 (E9-1-1) Enterprise Voice implementation to notify an emergency services operator of the caller's location.","yes","no","yes","yes","no","no","yes","no","yes","yes","Get-CsAdminRole | ? {$_.Cmdlets –match \"Get-CsLisPort\"}"]
["Get-CsLisServiceProvider","Get-CsLisServiceProvider",{"$f":"IF(ISTEXT(A106),(HYPERLINK(SUBSTITUTE(HLINK(A106),\".aspx\",\"\")&IF(C$1=2013,\"(v=ocs.15).aspx\",\"(v=ocs.14).aspx\"),A106)),\"\")","v":"Get-CsLisServiceProvider"},{"$f":"IF(ISTEXT(B106),(HYPERLINK(SUBSTITUTE(HLINK(B106),\".aspx\",\"\")&IF(D$1=2013,\"(v=ocs.15).aspx\",\"(v=ocs.14).aspx\"),B106)),\"\")","v":"Get-CsLisServiceProvider"},"Retrieves information about the web service provided by the Enhanced 9-1-1 (E9-1-1) Network Routing Provider to validate locations.","yes","no","yes","yes","no","no","yes","no","yes","yes","Get-CsAdminRole | ? {$_.Cmdlets –match \"Get-CsLisServiceProvider\"}"]
["Get-CsLisSubnet","Get-CsLisSubnet",{"$f":"IF(ISTEXT(A107),(HYPERLINK(SUBSTITUTE(HLINK(A107),\".aspx\",\"\")&IF(C$1=2013,\"(v=ocs.15).aspx\",\"(v=ocs.14).aspx\"),A107)),\"\")","v":"Get-CsLisSubnet"},{"$f":"IF(ISTEXT(B107),(HYPERLINK(SUBSTITUTE(HLINK(B107),\".aspx\",\"\")&IF(D$1=2013,\"(v=ocs.15).aspx\",\"(v=ocs.14).aspx\"),B107)),\"\")","v":"Get-CsLisSubnet"},"Retrieves one or more subnets from the location configuration database. Each subnet can be associated with a location, in which case this cmdlet will also retrieve the location information of the subnets. This location association is used in an Enhanced 9-1-1 (E9-1-1) Enterprise Voice implementation to notify an emergency services operator of the caller's location.","yes","no","yes","yes","no","no","yes","no","yes","yes","Get-CsAdminRole | ? {$_.Cmdlets –match \"Get-CsLisSubnet\"}"]
["Get-CsLisSwitch","Get-CsLisSwitch",{"$f":"IF(ISTEXT(A108),(HYPERLINK(SUBSTITUTE(HLINK(A108),\".aspx\",\"\")&IF(C$1=2013,\"(v=ocs.15).aspx\",\"(v=ocs.14).aspx\"),A108)),\"\")","v":"Get-CsLisSwitch"},{"$f":"IF(ISTEXT(B108),(HYPERLINK(SUBSTITUTE(HLINK(B108),\".aspx\",\"\")&IF(D$1=2013,\"(v=ocs.15).aspx\",\"(v=ocs.14).aspx\"),B108)),\"\")","v":"Get-CsLisSwitch"},"Retrieves one or more network switches from the location configuration database. Each switch can be associated with a location, in which case this cmdlet will also retrieve the location information of the switches. This location association is used in an Enhanced 9-1-1 (E9-1-1) Enterprise Voice implementation to notify an emergency services operator of the caller's location.","yes","no","yes","yes","no","no","yes","no","yes","yes","Get-CsAdminRole | ? {$_.Cmdlets –match \"Get-CsLisSwitch\"}"]
["Get-CsLisWirelessAccessPoint","Get-CsLisWirelessAccessPoint",{"$f":"IF(ISTEXT(A109),(HYPERLINK(SUBSTITUTE(HLINK(A109),\".aspx\",\"\")&IF(C$1=2013,\"(v=ocs.15).aspx\",\"(v=ocs.14).aspx\"),A109)),\"\")","v":"Get-CsLisWirelessAccessPoint"},{"$f":"IF(ISTEXT(B109),(HYPERLINK(SUBSTITUTE(HLINK(B109),\".aspx\",\"\")&IF(D$1=2013,\"(v=ocs.15).aspx\",\"(v=ocs.14).aspx\"),B109)),\"\")","v":"Get-CsLisWirelessAccessPoint"},"Retrieves one or more wireless access points (WAPs) from the location configuration database. Each WAP can be associated with a location, in which case this cmdlet will also retrieve the location information of the WAPs. This location association is used in an Enhanced 9-1-1 (E9-1-1) Enterprise Voice implementation to notify an emergency services operator of the caller's location.","yes","no","yes","yes","no","no","yes","no","yes","yes","Get-CsAdminRole | ? {$_.Cmdlets –match \"Get-CsLisWirelessAccessPoint\"}"]
["Get-CsLocationPolicy","Get-CsLocationPolicy",{"$f":"IF(ISTEXT(A110),(HYPERLINK(SUBSTITUTE(HLINK(A110),\".aspx\",\"\")&IF(C$1=2013,\"(v=ocs.15).aspx\",\"(v=ocs.14).aspx\"),A110)),\"\")","v":"Get-CsLocationPolicy"},{"$f":"IF(ISTEXT(B110),(HYPERLINK(SUBSTITUTE(HLINK(B110),\".aspx\",\"\")&IF(D$1=2013,\"(v=ocs.15).aspx\",\"(v=ocs.14).aspx\"),B110)),\"\")","v":"Get-CsLocationPolicy"},"Returns information about how (or if) the Enhanced 9-1-1 (E9-1-1) Location Information service has been configured. The E9-1-1 service enables those who answer emergency calls to determine the caller's geographic location.","yes","no","yes","yes","no","no","yes","yes","yes","yes","Get-CsAdminRole | ? {$_.Cmdlets –match \"Get-CsLocationPolicy\"}"]
["Get-CsManagementConnection","Get-CsManagementConnection",{"$f":"IF(ISTEXT(A111),(HYPERLINK(SUBSTITUTE(HLINK(A111),\".aspx\",\"\")&IF(C$1=2013,\"(v=ocs.15).aspx\",\"(v=ocs.14).aspx\"),A111)),\"\")","v":"Get-CsManagementConnection"},{"$f":"IF(ISTEXT(B111),(HYPERLINK(SUBSTITUTE(HLINK(B111),\".aspx\",\"\")&IF(D$1=2013,\"(v=ocs.15).aspx\",\"(v=ocs.14).aspx\"),B111)),\"\")","v":"Get-CsManagementConnection"},"Returns information about the management connection to the Central Management store.","yes","no","yes","no","no","no","yes","no","yes","no","Get-CsAdminRole | ? {$_.Cmdlets –match \"Get-CsManagementConnection\"}"]
["Get-CsManagementStoreReplicationStatus","Get-CsManagementStoreReplicationStatus",{"$f":"IF(ISTEXT(A112),(HYPERLINK(SUBSTITUTE(HLINK(A112),\".aspx\",\"\")&IF(C$1=2013,\"(v=ocs.15).aspx\",\"(v=ocs.14).aspx\"),A112)),\"\")","v":"Get-CsManagementStoreReplicationStatus"},{"$f":"IF(ISTEXT(B112),(HYPERLINK(SUBSTITUTE(HLINK(B112),\".aspx\",\"\")&IF(D$1=2013,\"(v=ocs.15).aspx\",\"(v=ocs.14).aspx\"),B112)),\"\")","v":"Get-CsManagementStoreReplicationStatus"},"Returns information about the Microsoft Lync Server 2010 replication process; this includes information on whether replication is currently up to date for your Lync Server 2010 computers.","yes","yes","yes","yes","no","yes","yes","yes","yes","yes","Get-CsAdminRole | ? {$_.Cmdlets –match \"Get-CsManagementStoreReplicationStatus\"}"]
["Get-CsMcxConfiguration","Get-CsMcxConfiguration",{"$f":"IF(ISTEXT(A113),(HYPERLINK(SUBSTITUTE(HLINK(A113),\".aspx\",\"\")&IF(C$1=2013,\"(v=ocs.15).aspx\",\"(v=ocs.14).aspx\"),A113)),\"\")","v":"Get-CsMcxConfiguration"},{"$f":"IF(ISTEXT(B113),(HYPERLINK(SUBSTITUTE(HLINK(B113),\".aspx\",\"\")&IF(D$1=2013,\"(v=ocs.15).aspx\",\"(v=ocs.14).aspx\"),B113)),\"\")","v":"Get-CsMcxConfiguration"},"Retrieves information about the Lync Server Mobility Service configuration settings currently in use in your organization. The Mobility Service enables users of mobile phones such as iPhones and Windows Phones to do such things as exchange instant messages and presence information; store and retrieve voice mail internally instead of with their wireless provider; and take advantage of Lync Server capabilities such as Call via Work and dial-out conferencing. This cmdlet was introduced in the cumulative update for Lync Server 2010: November 2011.","yes","no","yes","no","no","no","yes","no","yes","no","Get-CsAdminRole | ? {$_.Cmdlets –match \"Get-CsMcxConfiguration\"}"]
["Get-CsMediaConfiguration","Get-CsMediaConfiguration",{"$f":"IF(ISTEXT(A114),(HYPERLINK(SUBSTITUTE(HLINK(A114),\".aspx\",\"\")&IF(C$1=2013,\"(v=ocs.15).aspx\",\"(v=ocs.14).aspx\"),A114)),\"\")","v":"Get-CsMediaConfiguration"},{"$f":"IF(ISTEXT(B114),(HYPERLINK(SUBSTITUTE(HLINK(B114),\".aspx\",\"\")&IF(D$1=2013,\"(v=ocs.15).aspx\",\"(v=ocs.14).aspx\"),B114)),\"\")","v":"Get-CsMediaConfiguration"},"Returns information regarding media settings, including the supported level of encryption, whether Siren can be used as a voice codec by the Mediation Server, and the maximum allowed video resolution.","yes","no","yes","no","no","no","yes","no","yes","yes","Get-CsAdminRole | ? {$_.Cmdlets –match \"Get-CsMediaConfiguration\"}"]
["Get-CsMeetingConfiguration","Get-CsMeetingConfiguration",{"$f":"IF(ISTEXT(A115),(HYPERLINK(SUBSTITUTE(HLINK(A115),\".aspx\",\"\")&IF(C$1=2013,\"(v=ocs.15).aspx\",\"(v=ocs.14).aspx\"),A115)),\"\")","v":"Get-CsMeetingConfiguration"},{"$f":"IF(ISTEXT(B115),(HYPERLINK(SUBSTITUTE(HLINK(B115),\".aspx\",\"\")&IF(D$1=2013,\"(v=ocs.15).aspx\",\"(v=ocs.14).aspx\"),B115)),\"\")","v":"Get-CsMeetingConfiguration"},"Get-CsMeetingConfiguration enables you to return information about the meeting configuration settings currently in use in your organization. Meeting configuration settings help dictate the type of meetings (also called \"conferences\") that users can create, and control how (or even if) anonymous users and dial-in conferencing users can join these meetings.","yes","no","yes","no","no","no","yes","no","yes","no","Get-CsAdminRole | ? {$_.Cmdlets –match \"Get-CsMeetingConfiguration\"}"]
[null,"Get-CsMeetingRoom",{"$f":"IF(ISTEXT(A116),(HYPERLINK(SUBSTITUTE(HLINK(A116),\".aspx\",\"\")&IF(C$1=2013,\"(v=ocs.15).aspx\",\"(v=ocs.14).aspx\"),A116)),\"\")","v":""},{"$f":"IF(ISTEXT(B116),(HYPERLINK(SUBSTITUTE(HLINK(B116),\".aspx\",\"\")&IF(D$1=2013,\"(v=ocs.15).aspx\",\"(v=ocs.14).aspx\"),B116)),\"\")","v":"Get-CsMeetingRoom"},"Returns information about all the Lync Server 2013 meeting rooms configured for use in the organization. A meeting room is a conferencing device designed to address video conferencing and collaboration scenarios in small conference rooms. This cmdlet was introduced in Lync Server 2013.","yes","no","yes","no","no","no","yes","yes","yes","yes","Get-CsAdminRole | ? {$_.Cmdlets –match \"Get-CsMeetingRoom\"}"]
["Get-CsMobilityPolicy","Get-CsMobilityPolicy",{"$f":"IF(ISTEXT(A117),(HYPERLINK(SUBSTITUTE(HLINK(A117),\".aspx\",\"\")&IF(C$1=2013,\"(v=ocs.15).aspx\",\"(v=ocs.14).aspx\"),A117)),\"\")","v":"Get-CsMobilityPolicy"},{"$f":"IF(ISTEXT(B117),(HYPERLINK(SUBSTITUTE(HLINK(B117),\".aspx\",\"\")&IF(D$1=2013,\"(v=ocs.15).aspx\",\"(v=ocs.14).aspx\"),B117)),\"\")","v":"Get-CsMobilityPolicy"},"Retrieves information about the mobility policies currently in use in an organization. Mobility policies determine whether or not a user can use Lync Mobile. These policies also manage a user's ability to employ Call via Work, a feature that enables users to make and receive phone calls on their mobile phone by using their work phone number instead of their mobile phone number. Mobility policies can also be used to require Wi-Fi connections when making or receiving calls. This cmdlet was introduced in Lync Server 2010.","yes","no","yes","no","no","no","yes","yes","yes","no","Get-CsAdminRole | ? {$_.Cmdlets –match \"Get-CsMobilityPolicy\"}"]
["Get-CsNetworkBandwidthPolicyProfile","Get-CsNetworkBandwidthPolicyProfile",{"$f":"IF(ISTEXT(A118),(HYPERLINK(SUBSTITUTE(HLINK(A118),\".aspx\",\"\")&IF(C$1=2013,\"(v=ocs.15).aspx\",\"(v=ocs.14).aspx\"),A118)),\"\")","v":"Get-CsNetworkBandwidthPolicyProfile"},{"$f":"IF(ISTEXT(B118),(HYPERLINK(SUBSTITUTE(HLINK(B118),\".aspx\",\"\")&IF(D$1=2013,\"(v=ocs.15).aspx\",\"(v=ocs.14).aspx\"),B118)),\"\")","v":"Get-CsNetworkBandwidthPolicyProfile"},"Retrieves one or more network bandwidth policy profiles.","yes","no","yes","yes","no","no","yes","no","yes","yes","Get-CsAdminRole | ? {$_.Cmdlets –match \"Get-CsNetworkBandwidthPolicyProfile\"}"]
["Get-CsNetworkConfiguration","Get-CsNetworkConfiguration",{"$f":"IF(ISTEXT(A119),(HYPERLINK(SUBSTITUTE(HLINK(A119),\".aspx\",\"\")&IF(C$1=2013,\"(v=ocs.15).aspx\",\"(v=ocs.14).aspx\"),A119)),\"\")","v":"Get-CsNetworkConfiguration"},{"$f":"IF(ISTEXT(B119),(HYPERLINK(SUBSTITUTE(HLINK(B119),\".aspx\",\"\")&IF(D$1=2013,\"(v=ocs.15).aspx\",\"(v=ocs.14).aspx\"),B119)),\"\")","v":"Get-CsNetworkConfiguration"},"Retrieves global settings for call admission control (CAC), Enhanced 9-1-1 (E9-1-1), and media bypass.","yes","no","yes","no","no","no","yes","no","yes","yes","Get-CsAdminRole | ? {$_.Cmdlets –match \"Get-CsNetworkConfiguration\"}"]
["Get-CsNetworkInterface","Get-CsNetworkInterface",{"$f":"IF(ISTEXT(A120),(HYPERLINK(SUBSTITUTE(HLINK(A120),\".aspx\",\"\")&IF(C$1=2013,\"(v=ocs.15).aspx\",\"(v=ocs.14).aspx\"),A120)),\"\")","v":"Get-CsNetworkInterface"},{"$f":"IF(ISTEXT(B120),(HYPERLINK(SUBSTITUTE(HLINK(B120),\".aspx\",\"\")&IF(D$1=2013,\"(v=ocs.15).aspx\",\"(v=ocs.14).aspx\"),B120)),\"\")","v":"Get-CsNetworkInterface"},"Returns information about the network interfaces in use on computers running Microsoft Lync Server 2010 services or server roles.","yes","yes","yes","yes","no","yes","yes","yes","yes","yes","Get-CsAdminRole | ? {$_.Cmdlets –match \"Get-CsNetworkInterface\"}"]
["Get-CsNetworkInterRegionRoute","Get-CsNetworkInterRegionRoute",{"$f":"IF(ISTEXT(A121),(HYPERLINK(SUBSTITUTE(HLINK(A121),\".aspx\",\"\")&IF(C$1=2013,\"(v=ocs.15).aspx\",\"(v=ocs.14).aspx\"),A121)),\"\")","v":"Get-CsNetworkInterRegionRoute"},{"$f":"IF(ISTEXT(B121),(HYPERLINK(SUBSTITUTE(HLINK(B121),\".aspx\",\"\")&IF(D$1=2013,\"(v=ocs.15).aspx\",\"(v=ocs.14).aspx\"),B121)),\"\")","v":"Get-CsNetworkInterRegionRoute"},"Retrieves one or more routes that connect network regions within a call admission control (CAC) configuration.","yes","no","yes","no","no","no","yes","no","yes","yes","Get-CsAdminRole | ? {$_.Cmdlets –match \"Get-CsNetworkInterRegionRoute\"}"]
["Get-CsNetworkInterSitePolicy","Get-CsNetworkInterSitePolicy",{"$f":"IF(ISTEXT(A122),(HYPERLINK(SUBSTITUTE(HLINK(A122),\".aspx\",\"\")&IF(C$1=2013,\"(v=ocs.15).aspx\",\"(v=ocs.14).aspx\"),A122)),\"\")","v":"Get-CsNetworkInterSitePolicy"},{"$f":"IF(ISTEXT(B122),(HYPERLINK(SUBSTITUTE(HLINK(B122),\".aspx\",\"\")&IF(D$1=2013,\"(v=ocs.15).aspx\",\"(v=ocs.14).aspx\"),B122)),\"\")","v":"Get-CsNetworkInterSitePolicy"},"Retrieves one or more network inter-site policies, which define bandwidth limitations between sites that are directly linked within a call admission control (CAC) configuration.","yes","no","yes","no","no","no","yes","no","yes","yes","Get-CsAdminRole | ? {$_.Cmdlets –match \"Get-CsNetworkInterSitePolicy\"}"]
["Get-CsNetworkRegion","Get-CsNetworkRegion",{"$f":"IF(ISTEXT(A123),(HYPERLINK(SUBSTITUTE(HLINK(A123),\".aspx\",\"\")&IF(C$1=2013,\"(v=ocs.15).aspx\",\"(v=ocs.14).aspx\"),A123)),\"\")","v":"Get-CsNetworkRegion"},{"$f":"IF(ISTEXT(B123),(HYPERLINK(SUBSTITUTE(HLINK(B123),\".aspx\",\"\")&IF(D$1=2013,\"(v=ocs.15).aspx\",\"(v=ocs.14).aspx\"),B123)),\"\")","v":"Get-CsNetworkRegion"},"Retrieves one or more network regions. Network regions represent network hubs or backbones in an enterprise network.","yes","no","yes","yes","no","no","yes","no","yes","yes","Get-CsAdminRole | ? {$_.Cmdlets –match \"Get-CsNetworkRegion\"}"]
["Get-CsNetworkRegionLink","Get-CsNetworkRegionLink",{"$f":"IF(ISTEXT(A124),(HYPERLINK(SUBSTITUTE(HLINK(A124),\".aspx\",\"\")&IF(C$1=2013,\"(v=ocs.15).aspx\",\"(v=ocs.14).aspx\"),A124)),\"\")","v":"Get-CsNetworkRegionLink"},{"$f":"IF(ISTEXT(B124),(HYPERLINK(SUBSTITUTE(HLINK(B124),\".aspx\",\"\")&IF(D$1=2013,\"(v=ocs.15).aspx\",\"(v=ocs.14).aspx\"),B124)),\"\")","v":"Get-CsNetworkRegionLink"},"Retrieves one or more links between network regions configured for call admission control (CAC).","yes","no","yes","no","no","no","yes","no","yes","yes","Get-CsAdminRole | ? {$_.Cmdlets –match \"Get-CsNetworkRegionLink\"}"]
["Get-CsNetworkSite","Get-CsNetworkSite",{"$f":"IF(ISTEXT(A125),(HYPERLINK(SUBSTITUTE(HLINK(A125),\".aspx\",\"\")&IF(C$1=2013,\"(v=ocs.15).aspx\",\"(v=ocs.14).aspx\"),A125)),\"\")","v":"Get-CsNetworkSite"},{"$f":"IF(ISTEXT(B125),(HYPERLINK(SUBSTITUTE(HLINK(B125),\".aspx\",\"\")&IF(D$1=2013,\"(v=ocs.15).aspx\",\"(v=ocs.14).aspx\"),B125)),\"\")","v":"Get-CsNetworkSite"},"Retrieves one or more network sites defined for call admission control (CAC) or Enhanced 9-1-1 (E9-1-1).","yes","no","yes","yes","no","no","yes","no","yes","yes","Get-CsAdminRole | ? {$_.Cmdlets –match \"Get-CsNetworkSite\"}"]
["Get-CsNetworkSubnet","Get-CsNetworkSubnet",{"$f":"IF(ISTEXT(A126),(HYPERLINK(SUBSTITUTE(HLINK(A126),\".aspx\",\"\")&IF(C$1=2013,\"(v=ocs.15).aspx\",\"(v=ocs.14).aspx\"),A126)),\"\")","v":"Get-CsNetworkSubnet"},{"$f":"IF(ISTEXT(B126),(HYPERLINK(SUBSTITUTE(HLINK(B126),\".aspx\",\"\")&IF(D$1=2013,\"(v=ocs.15).aspx\",\"(v=ocs.14).aspx\"),B126)),\"\")","v":"Get-CsNetworkSubnet"},"Retrieves information about one or more network subnets.","yes","no","yes","yes","no","no","yes","no","yes","yes","Get-CsAdminRole | ? {$_.Cmdlets –match \"Get-CsNetworkSubnet\"}"]
[null,"Get-CsOAuthConfiguration",{"$f":"IF(ISTEXT(A127),(HYPERLINK(SUBSTITUTE(HLINK(A127),\".aspx\",\"\")&IF(C$1=2013,\"(v=ocs.15).aspx\",\"(v=ocs.14).aspx\"),A127)),\"\")","v":""},{"$f":"IF(ISTEXT(B127),(HYPERLINK(SUBSTITUTE(HLINK(B127),\".aspx\",\"\")&IF(D$1=2013,\"(v=ocs.15).aspx\",\"(v=ocs.14).aspx\"),B127)),\"\")","v":"Get-CsOAuthConfiguration"},"Returns information about the Open Authorization (OAuth) configuration settings currently in use in the organization. OAuth is a standard protocol used for server-to-server authentication and authorization. This cmdlet was introduced in Lync Server 2013.","yes","no","no","no","no","no","yes","no","yes","no",{"$f":"\"Get-CsAdminRole | ? {$_.Cmdlets –match \"& CHAR(34) &B127& CHAR(34) &\"}\"","v":"Get-CsAdminRole | ? {$_.Cmdlets –match \"Get-CsOAuthConfiguration\"}"}]
[null,"Get-CsOAuthServer",{"$f":"IF(ISTEXT(A128),(HYPERLINK(SUBSTITUTE(HLINK(A128),\".aspx\",\"\")&IF(C$1=2013,\"(v=ocs.15).aspx\",\"(v=ocs.14).aspx\"),A128)),\"\")","v":""},{"$f":"IF(ISTEXT(B128),(HYPERLINK(SUBSTITUTE(HLINK(B128),\".aspx\",\"\")&IF(D$1=2013,\"(v=ocs.15).aspx\",\"(v=ocs.14).aspx\"),B128)),\"\")","v":"Get-CsOAuthServer"},"Returns information about the Open Authorization (OAuth) servers configured for use by the organization. OAuth servers, also known as security token servers, issue security tokens used in server-to-server authentication and authorization. This cmdlet was introduced in Lync Server 2013.","yes","no","no","no","no","no","yes","no","yes","no",{"$f":"\"Get-CsAdminRole | ? {$_.Cmdlets –match \"& CHAR(34) &B128& CHAR(34) &\"}\"","v":"Get-CsAdminRole | ? {$_.Cmdlets –match \"Get-CsOAuthServer\"}"}]
[null,"Get-CsOutboundCallingNumberTranslationRule",{"$f":"IF(ISTEXT(A129),(HYPERLINK(SUBSTITUTE(HLINK(A129),\".aspx\",\"\")&IF(C$1=2013,\"(v=ocs.15).aspx\",\"(v=ocs.14).aspx\"),A129)),\"\")","v":""},{"$f":"IF(ISTEXT(B129),(HYPERLINK(SUBSTITUTE(HLINK(B129),\".aspx\",\"\")&IF(D$1=2013,\"(v=ocs.15).aspx\",\"(v=ocs.14).aspx\"),B129)),\"\")","v":"Get-CsOutboundCallingNumberTranslationRule"},"Returns information about the outbound calling number translation rules created for use in your organization. An outbound calling number translation rule converts the E.164 phone numbers used by Lync Server 2013 to a format that can be used by trunking peers that do not support E.164 numbers. This cmdlet was introduced in Lync Server 2013.","yes","no","no","no","no","no","yes","no","yes","yes","Get-CsAdminRole | ? {$_.Cmdlets –match \"Get-CsOutboundCallingNumberTranslationRule\"}"]
["Get-CsOutboundTranslationRule","Get-CsOutboundTranslationRule",{"$f":"IF(ISTEXT(A130),(HYPERLINK(SUBSTITUTE(HLINK(A130),\".aspx\",\"\")&IF(C$1=2013,\"(v=ocs.15).aspx\",\"(v=ocs.14).aspx\"),A130)),\"\")","v":"Get-CsOutboundTranslationRule"},{"$f":"IF(ISTEXT(B130),(HYPERLINK(SUBSTITUTE(HLINK(B130),\".aspx\",\"\")&IF(D$1=2013,\"(v=ocs.15).aspx\",\"(v=ocs.14).aspx\"),B130)),\"\")","v":"Get-CsOutboundTranslationRule"},"Retrieves one or more outbound translation rules. An outbound translation rule converts phone numbers to the local dialing format for interaction with private branch exchange (PBX) systems and public switched telephone network (PSTN) gateways.","yes","no","yes","no","no","no","yes","no","yes","yes","Get-CsAdminRole | ? {$_.Cmdlets –match \"Get-CsOutboundTranslationRule\"}"]
[null,"Get-CsPartnerApplication",{"$f":"IF(ISTEXT(A131),(HYPERLINK(SUBSTITUTE(HLINK(A131),\".aspx\",\"\")&IF(C$1=2013,\"(v=ocs.15).aspx\",\"(v=ocs.14).aspx\"),A131)),\"\")","v":""},{"$f":"IF(ISTEXT(B131),(HYPERLINK(SUBSTITUTE(HLINK(B131),\".aspx\",\"\")&IF(D$1=2013,\"(v=ocs.15).aspx\",\"(v=ocs.14).aspx\"),B131)),\"\")","v":"Get-CsPartnerApplication"},"Returns information about all the partner applications configured for use in the organization. A partner application is any application that Lync Server 2013 can directly exchange security tokens with, without having to exchange those tokens by using a third-party security token server. This cmdlet was introduced in Lync Server 2013.","yes","no","yes","no","no","no","yes","no","no","yes","Get-CsAdminRole | ? {$_.Cmdlets –match \"Get-CsPartnerApplication\"}"]
[null,"Get-CsPersistentChatAddin",{"$f":"IF(ISTEXT(A132),(HYPERLINK(SUBSTITUTE(HLINK(A132),\".aspx\",\"\")&IF(C$1=2013,\"(v=ocs.15).aspx\",\"(v=ocs.14).aspx\"),A132)),\"\")","v":""},{"$f":"IF(ISTEXT(B132),(HYPERLINK(SUBSTITUTE(HLINK(B132),\".aspx\",\"\")&IF(D$1=2013,\"(v=ocs.15).aspx\",\"(v=ocs.14).aspx\"),B132)),\"\")","v":"Get-CsPersistentChatAddin"},"Returns information about all the Persistent Chat add-ins configured for use in the organization. A Persistent Chat add-in is a customized web page that can be embedded within a Persistent Chat client. This cmdlet was introduced in Lync Server 2013.","yes","no","yes","no","yes","no","yes","no","yes","no","Get-CsAdminRole | ? {$_.Cmdlets –match \"Get-CsPersistentChatAddin\"}"]
[null,"Get-CsPersistentChatCategory",{"$f":"IF(ISTEXT(A133),(HYPERLINK(SUBSTITUTE(HLINK(A133),\".aspx\",\"\")&IF(C$1=2013,\"(v=ocs.15).aspx\",\"(v=ocs.14).aspx\"),A133)),\"\")","v":""},{"$f":"IF(ISTEXT(B133),(HYPERLINK(SUBSTITUTE(HLINK(B133),\".aspx\",\"\")&IF(D$1=2013,\"(v=ocs.15).aspx\",\"(v=ocs.14).aspx\"),B133)),\"\")","v":"Get-CsPersistentChatCategory"},"Returns information about the Persistent Chat categories in use in your organization. A Persistent Chat category represents a collection of Persistent Chat chat rooms. Each chat room must be associated with a category. This cmdlet was introduced in Lync Server 2013.","yes","no","yes","no","yes","no","yes","no","yes","no","Get-CsAdminRole | ? {$_.Cmdlets –match \"Get-CsPersistentChatCategory\"}"]
[null,"Get-CsPersistentChatComplianceConfiguration",{"$f":"IF(ISTEXT(A134),(HYPERLINK(SUBSTITUTE(HLINK(A134),\".aspx\",\"\")&IF(C$1=2013,\"(v=ocs.15).aspx\",\"(v=ocs.14).aspx\"),A134)),\"\")","v":""},{"$f":"IF(ISTEXT(B134),(HYPERLINK(SUBSTITUTE(HLINK(B134),\".aspx\",\"\")&IF(D$1=2013,\"(v=ocs.15).aspx\",\"(v=ocs.14).aspx\"),B134)),\"\")","v":"Get-CsPersistentChatComplianceConfiguration"},"Returns information about the Persistent Chat compliance configuration settings currently in use in the organization. Persistent Chat compliance enables administrators to maintain an archive of Persistent Chat items and activities including: new messages; new events (for example, a user entering or existing a chat room); file uploads and downloads; and any searches run against the chat history. This cmdlet was introduced in Lync Server 2013.","yes","yes","no","no","yes","no","yes","no","yes","no","Get-CsAdminRole | ? {$_.Cmdlets –match \"Get-CsPersistentChatComplianceConfiguration\"}"]
[null,"Get-CsPersistentChatConfiguration",{"$f":"IF(ISTEXT(A135),(HYPERLINK(SUBSTITUTE(HLINK(A135),\".aspx\",\"\")&IF(C$1=2013,\"(v=ocs.15).aspx\",\"(v=ocs.14).aspx\"),A135)),\"\")","v":""},{"$f":"IF(ISTEXT(B135),(HYPERLINK(SUBSTITUTE(HLINK(B135),\".aspx\",\"\")&IF(D$1=2013,\"(v=ocs.15).aspx\",\"(v=ocs.14).aspx\"),B135)),\"\")","v":"Get-CsPersistentChatConfiguration"},"Returns information about the Persistent Chat configuration settings currently in use in your organization. Persistent Chat configuration settings are used to manage the Persistent Chat service. For example, these settings allow you to specify the maximum number of users who can participate in a chat room. This cmdlet was introduced in Lync Server 2013.","yes","no","yes","no","yes","no","yes","no","yes","no",{"$f":"\"Get-CsAdminRole | ? {$_.Cmdlets –match \"& CHAR(34) &B135& CHAR(34) &\"}\"","v":"Get-CsAdminRole | ? {$_.Cmdlets –match \"Get-CsPersistentChatConfiguration\"}"}]
[null,"Get-CsPersistentChatEligiblePrincipal",{"$f":"IF(ISTEXT(A136),(HYPERLINK(SUBSTITUTE(HLINK(A136),\".aspx\",\"\")&IF(C$1=2013,\"(v=ocs.15).aspx\",\"(v=ocs.14).aspx\"),A136)),\"\")","v":""},{"$f":"IF(ISTEXT(B136),(HYPERLINK(SUBSTITUTE(HLINK(B136),\".aspx\",\"\")&IF(D$1=2013,\"(v=ocs.15).aspx\",\"(v=ocs.14).aspx\"),B136)),\"\")","v":"Get-CsPersistentChatEligiblePrincipal"},"Returns the eligible principals for a Persistent Chat category or chat room. Eligible principals include allowed members or managers (for a category of chat room) as well as allowed presenters (chat room only). This cmdlet was introduced in Lync Server 2013.","yes","no","no","no","yes","no","yes","no","no","no","Get-CsAdminRole | ? {$_.Cmdlets –match \"Get-CsPersistentChatEligiblePrincipal\"}"]
[null,"Get-CsPersistentChatEndpoint",{"$f":"IF(ISTEXT(A137),(HYPERLINK(SUBSTITUTE(HLINK(A137),\".aspx\",\"\")&IF(C$1=2013,\"(v=ocs.15).aspx\",\"(v=ocs.14).aspx\"),A137)),\"\")","v":""},{"$f":"IF(ISTEXT(B137),(HYPERLINK(SUBSTITUTE(HLINK(B137),\".aspx\",\"\")&IF(D$1=2013,\"(v=ocs.15).aspx\",\"(v=ocs.14).aspx\"),B137)),\"\")","v":"Get-CsPersistentChatEndpoint"},"Returns information about the Persistent Chat endpoints configured for use in the organization. A Persistent Chat endpoint is an Active Directory contact object provides a friendly URL for a Lync Server 2013 Persistent Chat pool. This cmdlet was introduced in Lync Server 2013.","yes","no","no","no","yes","no","yes","no","yes","no","Get-CsAdminRole | ? {$_.Cmdlets –match \"Get-CsPersistentChatEndpoint\"}"]
[null,"Get-CsPersistentChatPolicy",{"$f":"IF(ISTEXT(A138),(HYPERLINK(SUBSTITUTE(HLINK(A138),\".aspx\",\"\")&IF(C$1=2013,\"(v=ocs.15).aspx\",\"(v=ocs.14).aspx\"),A138)),\"\")","v":""},{"$f":"IF(ISTEXT(B138),(HYPERLINK(SUBSTITUTE(HLINK(B138),\".aspx\",\"\")&IF(D$1=2013,\"(v=ocs.15).aspx\",\"(v=ocs.14).aspx\"),B138)),\"\")","v":"Get-CsPersistentChatPolicy"},"Returns information about the Persistent Chat policies configured for use in your organization. Persistent Chat policies determine whether or not users are allowed access to Persistent Chat chat rooms. This cmdlet was introduced in Lync Server 2013.","yes","no","yes","no","yes","no","yes","yes","yes","no","Get-CsAdminRole | ? {$_.Cmdlets –match \"Get-CsPersistentChatPolicy\"}"]
[null,"Get-CsPersistentChatRoom",{"$f":"IF(ISTEXT(A139),(HYPERLINK(SUBSTITUTE(HLINK(A139),\".aspx\",\"\")&IF(C$1=2013,\"(v=ocs.15).aspx\",\"(v=ocs.14).aspx\"),A139)),\"\")","v":""},{"$f":"IF(ISTEXT(B139),(HYPERLINK(SUBSTITUTE(HLINK(B139),\".aspx\",\"\")&IF(D$1=2013,\"(v=ocs.15).aspx\",\"(v=ocs.14).aspx\"),B139)),\"\")","v":"Get-CsPersistentChatRoom"},"Returns information about the Persistent Chat chat rooms configured for use in your organization. A chat room is a discussion forum that typically revolves around a specific topic. This cmdlet was introduced in Lync Server 2013.","yes","no","no","no","yes","no","yes","no","yes","no","Get-CsAdminRole | ? {$_.Cmdlets –match \"Get-CsPersistentChatRoom\"}"]
[null,"Get-CsPersistentChatState",{"$f":"IF(ISTEXT(A140),(HYPERLINK(SUBSTITUTE(HLINK(A140),\".aspx\",\"\")&IF(C$1=2013,\"(v=ocs.15).aspx\",\"(v=ocs.14).aspx\"),A140)),\"\")","v":""},{"$f":"IF(ISTEXT(B140),(HYPERLINK(SUBSTITUTE(HLINK(B140),\".aspx\",\"\")&IF(D$1=2013,\"(v=ocs.15).aspx\",\"(v=ocs.14).aspx\"),B140)),\"\")","v":"Get-CsPersistentChatState"},"Returns the state of one or more Persistent Chat service pools. Persistent Chat pools can be in one of two states: Normal, in which the pool uses its primary databases; or FailedOver, in which the pool uses the backup databases defined in the topology. This cmdlet was introduced in Lync Server 2013.","yes","no","yes","no","yes","no","yes","no","no","no","Get-CsAdminRole | ? {$_.Cmdlets –match \"Get-CsPersistentChatState\"}"]
["Get-CsPinPolicy","Get-CsPinPolicy",{"$f":"IF(ISTEXT(A141),(HYPERLINK(SUBSTITUTE(HLINK(A141),\".aspx\",\"\")&IF(C$1=2013,\"(v=ocs.15).aspx\",\"(v=ocs.14).aspx\"),A141)),\"\")","v":"Get-CsPinPolicy"},{"$f":"IF(ISTEXT(B141),(HYPERLINK(SUBSTITUTE(HLINK(B141),\".aspx\",\"\")&IF(D$1=2013,\"(v=ocs.15).aspx\",\"(v=ocs.14).aspx\"),B141)),\"\")","v":"Get-CsPinPolicy"},"Returns information about the client personal identification number (PIN) policies configured for use in your organization. PIN authentication enables users to access Microsoft Lync Server 2010 by providing a PIN instead of a user name and password.","yes","no","yes","no","no","no","yes","yes","yes","yes","Get-CsAdminRole | ? {$_.Cmdlets –match \"Get-CsPinPolicy\"}"]
["Get-CsPool","Get-CsPool",{"$f":"IF(ISTEXT(A142),(HYPERLINK(SUBSTITUTE(HLINK(A142),\".aspx\",\"\")&IF(C$1=2013,\"(v=ocs.15).aspx\",\"(v=ocs.14).aspx\"),A142)),\"\")","v":"Get-CsPool"},{"$f":"IF(ISTEXT(B142),(HYPERLINK(SUBSTITUTE(HLINK(B142),\".aspx\",\"\")&IF(D$1=2013,\"(v=ocs.15).aspx\",\"(v=ocs.14).aspx\"),B142)),\"\")","v":"Get-CsPool"},"Returns information about the pools used in your deployment of Microsoft Lync Server 2010. Pools are a collection of computers in a site that all run the same set of Lync Server 2010 services.","yes","yes","yes","yes","yes","yes","yes","yes","yes","yes","Get-CsAdminRole | ? {$_.Cmdlets –match \"Get-CsPool\"}"]
[null,"Get-CsPoolBackupRelationship",{"$f":"IF(ISTEXT(A143),(HYPERLINK(SUBSTITUTE(HLINK(A143),\".aspx\",\"\")&IF(C$1=2013,\"(v=ocs.15).aspx\",\"(v=ocs.14).aspx\"),A143)),\"\")","v":""},{"$f":"IF(ISTEXT(B143),(HYPERLINK(SUBSTITUTE(HLINK(B143),\".aspx\",\"\")&IF(D$1=2013,\"(v=ocs.15).aspx\",\"(v=ocs.14).aspx\"),B143)),\"\")","v":"Get-CsPoolBackupRelationship"},"Returns information about the backup pool associated with a Lync Online pool. This cmdlet was introduced in Lync Server 2013.","yes",null,null,null,"no",null,"yes",null,"yes",null,{"$f":"\"Get-CsAdminRole | ? {$_.Cmdlets –match \"& CHAR(34) &B143& CHAR(34) &\"}\"","v":"Get-CsAdminRole | ? {$_.Cmdlets –match \"Get-CsPoolBackupRelationship\"}"}]
[null,"Get-CsPoolFabricState",{"$f":"IF(ISTEXT(A144),(HYPERLINK(SUBSTITUTE(HLINK(A144),\".aspx\",\"\")&IF(C$1=2013,\"(v=ocs.15).aspx\",\"(v=ocs.14).aspx\"),A144)),\"\")","v":""},{"$f":"IF(ISTEXT(B144),(HYPERLINK(SUBSTITUTE(HLINK(B144),\".aspx\",\"\")&IF(D$1=2013,\"(v=ocs.15).aspx\",\"(v=ocs.14).aspx\"),B144)),\"\")","v":"Get-CsPoolFabricState"},"Returns the Windows Fabric state for a Lync Server 2013 pool. Windows Fabric is a Microsoft technology used for creating highly reliable, distributable, and scalable applications. This cmdlet was introduced in Lync Server 2013.","no","no","no","no","no","no","no","no","no","no","Get-CsAdminRole | ? {$_.Cmdlets –match \"Get-CsPoolFabricState\"}"]
[null,"Get-CsPoolUpgradeReadinessState",{"$f":"IF(ISTEXT(A145),(HYPERLINK(SUBSTITUTE(HLINK(A145),\".aspx\",\"\")&IF(C$1=2013,\"(v=ocs.15).aspx\",\"(v=ocs.14).aspx\"),A145)),\"\")","v":""},{"$f":"IF(ISTEXT(B145),(HYPERLINK(SUBSTITUTE(HLINK(B145),\".aspx\",\"\")&IF(D$1=2013,\"(v=ocs.15).aspx\",\"(v=ocs.14).aspx\"),B145)),\"\")","v":"Get-CsPoolUpgradeReadinessState"},"Returns information indicating whether or not your Lync Online Registrar pools are ready to be upgraded. The upgrade readiness state for a pool is based on the upgrade domains that have been configured for that pool. This cmdlet was introduced in Lync Server 2013.","no","no","no","no","no","no","no","no","no","no",{"$f":"\"Get-CsAdminRole | ? {$_.Cmdlets –match \"& CHAR(34) &B145& CHAR(34) &\"}\"","v":"Get-CsAdminRole | ? {$_.Cmdlets –match \"Get-CsPoolUpgradeReadinessState\"}"}]
["Get-CsPresencePolicy","Get-CsPresencePolicy",{"$f":"IF(ISTEXT(A146),(HYPERLINK(SUBSTITUTE(HLINK(A146),\".aspx\",\"\")&IF(C$1=2013,\"(v=ocs.15).aspx\",\"(v=ocs.14).aspx\"),A146)),\"\")","v":"Get-CsPresencePolicy"},{"$f":"IF(ISTEXT(B146),(HYPERLINK(SUBSTITUTE(HLINK(B146),\".aspx\",\"\")&IF(D$1=2013,\"(v=ocs.15).aspx\",\"(v=ocs.14).aspx\"),B146)),\"\")","v":"Get-CsPresencePolicy"},"Returns information about the presence policies configured for use in your organization.","yes","no","yes","no","no","no","yes","yes","yes","no","Get-CsAdminRole | ? {$_.Cmdlets –match \"Get-CsPresencePolicy\"}"]
[null,"Get-CsPresenceProvider",{"$f":"IF(ISTEXT(A147),(HYPERLINK(SUBSTITUTE(HLINK(A147),\".aspx\",\"\")&IF(C$1=2013,\"(v=ocs.15).aspx\",\"(v=ocs.14).aspx\"),A147)),\"\")","v":""},{"$f":"IF(ISTEXT(B147),(HYPERLINK(SUBSTITUTE(HLINK(B147),\".aspx\",\"\")&IF(D$1=2013,\"(v=ocs.15).aspx\",\"(v=ocs.14).aspx\"),B147)),\"\")","v":"Get-CsPresenceProvider"},"Returns information about the presence providers configured for use in the organization. Presence providers represent the PresenceProviders property of a collection of user services configuration settings. This cmdlet was introduced in Lync Server 2013.","yes","no","no","no","no","no","yes","no","yes","no","Get-CsAdminRole | ? {$_.Cmdlets –match \"Get-CsPresenceProvider\"}"]
["Get-CsPrivacyConfiguration","Get-CsPrivacyConfiguration",{"$f":"IF(ISTEXT(A148),(HYPERLINK(SUBSTITUTE(HLINK(A148),\".aspx\",\"\")&IF(C$1=2013,\"(v=ocs.15).aspx\",\"(v=ocs.14).aspx\"),A148)),\"\")","v":"Get-CsPrivacyConfiguration"},{"$f":"IF(ISTEXT(B148),(HYPERLINK(SUBSTITUTE(HLINK(B148),\".aspx\",\"\")&IF(D$1=2013,\"(v=ocs.15).aspx\",\"(v=ocs.14).aspx\"),B148)),\"\")","v":"Get-CsPrivacyConfiguration"},"Returns information about the privacy configuration settings currently in use in your organization. Privacy configuration settings help determine how much information users make available to other users.","yes","no","yes","no","no","no","yes","no","yes","no","Get-CsAdminRole | ? {$_.Cmdlets –match \"Get-CsPrivacyConfiguration\"}"]
["Get-CsProxyConfiguration","Get-CsProxyConfiguration",{"$f":"IF(ISTEXT(A149),(HYPERLINK(SUBSTITUTE(HLINK(A149),\".aspx\",\"\")&IF(C$1=2013,\"(v=ocs.15).aspx\",\"(v=ocs.14).aspx\"),A149)),\"\")","v":"Get-CsProxyConfiguration"},{"$f":"IF(ISTEXT(B149),(HYPERLINK(SUBSTITUTE(HLINK(B149),\".aspx\",\"\")&IF(D$1=2013,\"(v=ocs.15).aspx\",\"(v=ocs.14).aspx\"),B149)),\"\")","v":"Get-CsProxyConfiguration"},"Returns information about the proxy server configuration settings currently in use in your organization.","yes","no","yes","no","no","no","yes","no","yes","no","Get-CsAdminRole | ? {$_.Cmdlets –match \"Get-CsProxyConfiguration\"}"]
["Get-CsPstnUsage","Get-CsPstnUsage",{"$f":"IF(ISTEXT(A150),(HYPERLINK(SUBSTITUTE(HLINK(A150),\".aspx\",\"\")&IF(C$1=2013,\"(v=ocs.15).aspx\",\"(v=ocs.14).aspx\"),A150)),\"\")","v":"Get-CsPstnUsage"},{"$f":"IF(ISTEXT(B150),(HYPERLINK(SUBSTITUTE(HLINK(B150),\".aspx\",\"\")&IF(D$1=2013,\"(v=ocs.15).aspx\",\"(v=ocs.14).aspx\"),B150)),\"\")","v":"Get-CsPstnUsage"},"Returns information about public switched telephone network (PSTN) usage records used in your organization.","yes","no","yes","no","no","no","yes","yes","yes","yes","Get-CsAdminRole | ? {$_.Cmdlets –match \"Get-CsPstnUsage\"}"]
["Get-CsPublicProvider","Get-CsPublicProvider",{"$f":"IF(ISTEXT(A151),(HYPERLINK(SUBSTITUTE(HLINK(A151),\".aspx\",\"\")&IF(C$1=2013,\"(v=ocs.15).aspx\",\"(v=ocs.14).aspx\"),A151)),\"\")","v":"Get-CsPublicProvider"},{"$f":"IF(ISTEXT(B151),(HYPERLINK(SUBSTITUTE(HLINK(B151),\".aspx\",\"\")&IF(D$1=2013,\"(v=ocs.15).aspx\",\"(v=ocs.14).aspx\"),B151)),\"\")","v":"Get-CsPublicProvider"},"Returns information about the public providers configured for use in your organization. A public provider is an organization that provides instant messaging, presence, and related services to the general public. Microsoft Lync Server 2010 ships with three public providers configured but not enabled: Yahoo!; AOL; and MSN.","yes","no","yes","no","no","no","yes","no","yes","no","Get-CsAdminRole | ? {$_.Cmdlets –match \"Get-CsPublicProvider\"}"]
["Get-CsPushNotificationConfiguration","Get-CsPushNotificationConfiguration",{"$f":"IF(ISTEXT(A152),(HYPERLINK(SUBSTITUTE(HLINK(A152),\".aspx\",\"\")&IF(C$1=2013,\"(v=ocs.15).aspx\",\"(v=ocs.14).aspx\"),A152)),\"\")","v":"Get-CsPushNotificationConfiguration"},{"$f":"IF(ISTEXT(B152),(HYPERLINK(SUBSTITUTE(HLINK(B152),\".aspx\",\"\")&IF(D$1=2013,\"(v=ocs.15).aspx\",\"(v=ocs.14).aspx\"),B152)),\"\")","v":"Get-CsPushNotificationConfiguration"},"Retrieves information about the push notification configuration settings currently in use in your organization. The push notification service (Apple Push Notification Service and Microsoft Push Notification Service) provides a way to send notifications about events such as new instant messages or new voice mail to mobile devices such as iPhones and Windows Phones, even if the Lync application on those devices is currently suspended or running in the background. This cmdlet was introduced in the cumulative update for Lync Server 2010: November 2011.","yes","no","yes","no","no","no","yes","no","yes","no","Get-CsAdminRole | ? {$_.Cmdlets –match \"Get-CsPushNotificationConfiguration\"}"]
["Get-CsQoEConfiguration","Get-CsQoEConfiguration",{"$f":"IF(ISTEXT(A153),(HYPERLINK(SUBSTITUTE(HLINK(A153),\".aspx\",\"\")&IF(C$1=2013,\"(v=ocs.15).aspx\",\"(v=ocs.14).aspx\"),A153)),\"\")","v":"Get-CsQoEConfiguration"},{"$f":"IF(ISTEXT(B153),(HYPERLINK(SUBSTITUTE(HLINK(B153),\".aspx\",\"\")&IF(D$1=2013,\"(v=ocs.15).aspx\",\"(v=ocs.14).aspx\"),B153)),\"\")","v":"Get-CsQoEConfiguration"},"Retrieves one or more collections of Quality of Experience (QoE) settings.","yes","no","yes","no","no","no","yes","no","yes","yes","Get-CsAdminRole | ? {$_.Cmdlets –match \"Get-CsQoEConfiguration\"}"]
["Get-CsRegistrarConfiguration","Get-CsRegistrarConfiguration",{"$f":"IF(ISTEXT(A154),(HYPERLINK(SUBSTITUTE(HLINK(A154),\".aspx\",\"\")&IF(C$1=2013,\"(v=ocs.15).aspx\",\"(v=ocs.14).aspx\"),A154)),\"\")","v":"Get-CsRegistrarConfiguration"},{"$f":"IF(ISTEXT(B154),(HYPERLINK(SUBSTITUTE(HLINK(B154),\".aspx\",\"\")&IF(D$1=2013,\"(v=ocs.15).aspx\",\"(v=ocs.14).aspx\"),B154)),\"\")","v":"Get-CsRegistrarConfiguration"},"Returns information about the Registrar configuration settings currently in use in your organization. Registrars are used to authenticate logon requests and to maintain information about user status and availability.","yes","no","yes","no","no","no","yes","no","yes","no","Get-CsAdminRole | ? {$_.Cmdlets –match \"Get-CsRegistrarConfiguration\"}"]
[null,"Get-CsReportingConfiguration",{"$f":"IF(ISTEXT(A155),(HYPERLINK(SUBSTITUTE(HLINK(A155),\".aspx\",\"\")&IF(C$1=2013,\"(v=ocs.15).aspx\",\"(v=ocs.14).aspx\"),A155)),\"\")","v":""},{"$f":"IF(ISTEXT(B155),(HYPERLINK(SUBSTITUTE(HLINK(B155),\".aspx\",\"\")&IF(D$1=2013,\"(v=ocs.15).aspx\",\"(v=ocs.14).aspx\"),B155)),\"\")","v":"Get-CsReportingConfiguration"},"Returns information about the reporting configuration settings in use in the organization. Reporting configuration settings are used to specify the URL used for accessing Lync Server 2013 Monitoring Reports. This cmdlet was introduced in Lync Server 2013.","yes","no","no","no","no","no","yes","no","yes","no","Get-CsAdminRole | ? {$_.Cmdlets –match \"Get-CsReportingConfiguration\"}"]
["Get-CsRgsAgentGroup","Get-CsRgsAgentGroup",{"$f":"IF(ISTEXT(A156),(HYPERLINK(SUBSTITUTE(HLINK(A156),\".aspx\",\"\")&IF(C$1=2013,\"(v=ocs.15).aspx\",\"(v=ocs.14).aspx\"),A156)),\"\")","v":"Get-CsRgsAgentGroup"},{"$f":"IF(ISTEXT(B156),(HYPERLINK(SUBSTITUTE(HLINK(B156),\".aspx\",\"\")&IF(D$1=2013,\"(v=ocs.15).aspx\",\"(v=ocs.14).aspx\"),B156)),\"\")","v":"Get-CsRgsAgentGroup"},"Returns information about the Response Group agent groups configured for use in your organization. An agent group is a collection of agents assigned to a Response Group queue. Agents are the users assigned to answer calls directed to a queue.","yes","no","yes","no","no","yes","yes","no","yes","yes","Get-CsAdminRole | ? {$_.Cmdlets –match \"Get-CsRgsAgentGroup\"}"]
["Get-CsRgsConfiguration","Get-CsRgsConfiguration",{"$f":"IF(ISTEXT(A157),(HYPERLINK(SUBSTITUTE(HLINK(A157),\".aspx\",\"\")&IF(C$1=2013,\"(v=ocs.15).aspx\",\"(v=ocs.14).aspx\"),A157)),\"\")","v":"Get-CsRgsConfiguration"},{"$f":"IF(ISTEXT(B157),(HYPERLINK(SUBSTITUTE(HLINK(B157),\".aspx\",\"\")&IF(D$1=2013,\"(v=ocs.15).aspx\",\"(v=ocs.14).aspx\"),B157)),\"\")","v":"Get-CsRgsConfiguration"},"Returns information about configuration settings for the Response Group application.","yes","no","yes","no","no","yes","yes","no","yes","yes","Get-CsAdminRole | ? {$_.Cmdlets –match \"Get-CsRgsConfiguration\"}"]
["Get-CsRgsHolidaySet","Get-CsRgsHolidaySet",{"$f":"IF(ISTEXT(A158),(HYPERLINK(SUBSTITUTE(HLINK(A158),\".aspx\",\"\")&IF(C$1=2013,\"(v=ocs.15).aspx\",\"(v=ocs.14).aspx\"),A158)),\"\")","v":"Get-CsRgsHolidaySet"},{"$f":"IF(ISTEXT(B158),(HYPERLINK(SUBSTITUTE(HLINK(B158),\".aspx\",\"\")&IF(D$1=2013,\"(v=ocs.15).aspx\",\"(v=ocs.14).aspx\"),B158)),\"\")","v":"Get-CsRgsHolidaySet"},"Returns information about the Response Group holiday sets configured for use in your organization. A Response Group holiday set is a collection of holidays. For example, you might have one holiday set for a United States (U.S.)-based queue (a set which might include a holiday for the Fourth of July) and a different set for a queue based in France. The latter queue might define a holiday for Bastille Day but not for the Fourth of July.","yes","no","yes","no","no","yes","yes","no","yes","yes","Get-CsAdminRole | ? {$_.Cmdlets –match \"Get-CsRgsHolidaySet\"}"]
["Get-CsRgsHoursOfBusiness","Get-CsRgsHoursOfBusiness",{"$f":"IF(ISTEXT(A159),(HYPERLINK(SUBSTITUTE(HLINK(A159),\".aspx\",\"\")&IF(C$1=2013,\"(v=ocs.15).aspx\",\"(v=ocs.14).aspx\"),A159)),\"\")","v":"Get-CsRgsHoursOfBusiness"},{"$f":"IF(ISTEXT(B159),(HYPERLINK(SUBSTITUTE(HLINK(B159),\".aspx\",\"\")&IF(D$1=2013,\"(v=ocs.15).aspx\",\"(v=ocs.14).aspx\"),B159)),\"\")","v":"Get-CsRgsHoursOfBusiness"},"Retrieves information about the Response Group business hour collections configured for use in your organization. Business hour collections are used to indicate the days of the week and the times of day when Response Group agents are typically available to answer phone calls.","yes","no","yes","no","no","yes","yes","no","yes","yes","Get-CsAdminRole | ? {$_.Cmdlets –match \"Get-CsRgsHoursOfBusiness\"}"]
["Get-CsRgsQueue","Get-CsRgsQueue",{"$f":"IF(ISTEXT(A160),(HYPERLINK(SUBSTITUTE(HLINK(A160),\".aspx\",\"\")&IF(C$1=2013,\"(v=ocs.15).aspx\",\"(v=ocs.14).aspx\"),A160)),\"\")","v":"Get-CsRgsQueue"},{"$f":"IF(ISTEXT(B160),(HYPERLINK(SUBSTITUTE(HLINK(B160),\".aspx\",\"\")&IF(D$1=2013,\"(v=ocs.15).aspx\",\"(v=ocs.14).aspx\"),B160)),\"\")","v":"Get-CsRgsQueue"},"Retrieves information about the Response Group queues in use in your organization. With the Response Group application, phone calls are put in a queue and calls are placed on hold until a Response Group agent is available to answer that call.","yes","no","yes","no","no","yes","yes","no","yes","yes","Get-CsAdminRole | ? {$_.Cmdlets –match \"Get-CsRgsQueue\"}"]
["Get-CsRgsWorkflow","Get-CsRgsWorkflow",{"$f":"IF(ISTEXT(A161),(HYPERLINK(SUBSTITUTE(HLINK(A161),\".aspx\",\"\")&IF(C$1=2013,\"(v=ocs.15).aspx\",\"(v=ocs.14).aspx\"),A161)),\"\")","v":"Get-CsRgsWorkflow"},{"$f":"IF(ISTEXT(B161),(HYPERLINK(SUBSTITUTE(HLINK(B161),\".aspx\",\"\")&IF(D$1=2013,\"(v=ocs.15).aspx\",\"(v=ocs.14).aspx\"),B161)),\"\")","v":"Get-CsRgsWorkflow"},"Returns information about Response Group workflows. Workflows determine the actions that are taken when the Response Group application receives a phone call.","yes","no","yes","no","no","yes","yes","no","yes","yes","Get-CsAdminRole | ? {$_.Cmdlets –match \"Get-CsRgsWorkflow\"}"]
["Get-CsRoutingConfiguration","Get-CsRoutingConfiguration",{"$f":"IF(ISTEXT(A162),(HYPERLINK(SUBSTITUTE(HLINK(A162),\".aspx\",\"\")&IF(C$1=2013,\"(v=ocs.15).aspx\",\"(v=ocs.14).aspx\"),A162)),\"\")","v":"Get-CsRoutingConfiguration"},{"$f":"IF(ISTEXT(B162),(HYPERLINK(SUBSTITUTE(HLINK(B162),\".aspx\",\"\")&IF(D$1=2013,\"(v=ocs.15).aspx\",\"(v=ocs.14).aspx\"),B162)),\"\")","v":"Get-CsRoutingConfiguration"},"Retrieves the routing configuration object, which contains a list of all voice routes defined within a Microsoft Lync Server 2010 deployment.","yes","no","yes","no","no","no","yes","yes","yes","yes","Get-CsAdminRole | ? {$_.Cmdlets –match \"Get-CsRoutingConfiguration\"}"]
["Get-CsServerApplication","Get-CsServerApplication",{"$f":"IF(ISTEXT(A163),(HYPERLINK(SUBSTITUTE(HLINK(A163),\".aspx\",\"\")&IF(C$1=2013,\"(v=ocs.15).aspx\",\"(v=ocs.14).aspx\"),A163)),\"\")","v":"Get-CsServerApplication"},{"$f":"IF(ISTEXT(B163),(HYPERLINK(SUBSTITUTE(HLINK(B163),\".aspx\",\"\")&IF(D$1=2013,\"(v=ocs.15).aspx\",\"(v=ocs.14).aspx\"),B163)),\"\")","v":"Get-CsServerApplication"},"Returns information about the server applications in use in your organization. Server applications are applications that are hosted by Microsoft Lync Server 2010.","yes","no","yes","no","no","no","yes","no","yes","no","Get-CsAdminRole | ? {$_.Cmdlets –match \"Get-CsServerApplication\"}"]
["Get-CsServerVersion","Get-CsServerVersion",{"$f":"IF(ISTEXT(A164),(HYPERLINK(SUBSTITUTE(HLINK(A164),\".aspx\",\"\")&IF(C$1=2013,\"(v=ocs.15).aspx\",\"(v=ocs.14).aspx\"),A164)),\"\")","v":"Get-CsServerVersion"},{"$f":"IF(ISTEXT(B164),(HYPERLINK(SUBSTITUTE(HLINK(B164),\".aspx\",\"\")&IF(D$1=2013,\"(v=ocs.15).aspx\",\"(v=ocs.14).aspx\"),B164)),\"\")","v":"Get-CsServerVersion"},"Returns server licensing information for a computer running Microsoft Lync Server 2010.","no","no","no","no","no","no","no","no","no","no","Get-CsAdminRole | ? {$_.Cmdlets –match \"Get-CsServerVersion\"}"]
["Get-CsService","Get-CsService",{"$f":"IF(ISTEXT(A165),(HYPERLINK(SUBSTITUTE(HLINK(A165),\".aspx\",\"\")&IF(C$1=2013,\"(v=ocs.15).aspx\",\"(v=ocs.14).aspx\"),A165)),\"\")","v":"Get-CsService"},{"$f":"IF(ISTEXT(B165),(HYPERLINK(SUBSTITUTE(HLINK(B165),\".aspx\",\"\")&IF(D$1=2013,\"(v=ocs.15).aspx\",\"(v=ocs.14).aspx\"),B165)),\"\")","v":"Get-CsService"},"Returns information about the services and server roles being used in your Microsoft Lync Server 2010 infrastructure. A service is an instance of a role that has been deployed in a Lync Server 2010 pool. For example, you might have a pool of computers all running the Monitoring Server service.","yes","yes","yes","yes","yes","yes","yes","yes","yes","yes","Get-CsAdminRole | ? {$_.Cmdlets –match \"Get-CsService\"}"]
["Get-CsSimpleUrlConfiguration","Get-CsSimpleUrlConfiguration",{"$f":"IF(ISTEXT(A166),(HYPERLINK(SUBSTITUTE(HLINK(A166),\".aspx\",\"\")&IF(C$1=2013,\"(v=ocs.15).aspx\",\"(v=ocs.14).aspx\"),A166)),\"\")","v":"Get-CsSimpleUrlConfiguration"},{"$f":"IF(ISTEXT(B166),(HYPERLINK(SUBSTITUTE(HLINK(B166),\".aspx\",\"\")&IF(D$1=2013,\"(v=ocs.15).aspx\",\"(v=ocs.14).aspx\"),B166)),\"\")","v":"Get-CsSimpleUrlConfiguration"},"Returns information about the simple URLs configured for use in your organization. Simple URLs make it easier for users to join meetings and conferences, as well as making it easier for Administrators to log on to the Microsoft Lync Server 2010 Control Panel.","yes","no","yes","no","no","no","yes","no","yes","no","Get-CsAdminRole | ? {$_.Cmdlets –match \"Get-CsSimpleUrlConfiguration\"}"]
["Get-CsSipDomain","Get-CsSipDomain",{"$f":"IF(ISTEXT(A167),(HYPERLINK(SUBSTITUTE(HLINK(A167),\".aspx\",\"\")&IF(C$1=2013,\"(v=ocs.15).aspx\",\"(v=ocs.14).aspx\"),A167)),\"\")","v":"Get-CsSipDomain"},{"$f":"IF(ISTEXT(B167),(HYPERLINK(SUBSTITUTE(HLINK(B167),\".aspx\",\"\")&IF(D$1=2013,\"(v=ocs.15).aspx\",\"(v=ocs.14).aspx\"),B167)),\"\")","v":"Get-CsSipDomain"},"Returns information about the SIP domains configured for use in your organization. SIP domains are domains authorized to send and receive SIP traffic, and are used when assigning SIP addresses to users.","yes","no","yes","no","no","no","yes","yes","yes","no","Get-CsAdminRole | ? {$_.Cmdlets –match \"Get-CsSipDomain\"}"]
["Get-CsSipResponseCodeTranslationRule","Get-CsSipResponseCodeTranslationRule",{"$f":"IF(ISTEXT(A168),(HYPERLINK(SUBSTITUTE(HLINK(A168),\".aspx\",\"\")&IF(C$1=2013,\"(v=ocs.15).aspx\",\"(v=ocs.14).aspx\"),A168)),\"\")","v":"Get-CsSipResponseCodeTranslationRule"},{"$f":"IF(ISTEXT(B168),(HYPERLINK(SUBSTITUTE(HLINK(B168),\".aspx\",\"\")&IF(D$1=2013,\"(v=ocs.15).aspx\",\"(v=ocs.14).aspx\"),B168)),\"\")","v":"Get-CsSipResponseCodeTranslationRule"},"Returns information about SIP response code translation rules. These rules enable administrators to map SIP response codes with values between 400 and 699 to the values used by Microsoft Lync Server 2010.","yes","no","yes","no","no","no","yes","no","yes","yes","Get-CsAdminRole | ? {$_.Cmdlets –match \"Get-CsSipResponseCodeTranslationRule\"}"]
["Get-CsSite","Get-CsSite",{"$f":"IF(ISTEXT(A169),(HYPERLINK(SUBSTITUTE(HLINK(A169),\".aspx\",\"\")&IF(C$1=2013,\"(v=ocs.15).aspx\",\"(v=ocs.14).aspx\"),A169)),\"\")","v":"Get-CsSite"},{"$f":"IF(ISTEXT(B169),(HYPERLINK(SUBSTITUTE(HLINK(B169),\".aspx\",\"\")&IF(D$1=2013,\"(v=ocs.15).aspx\",\"(v=ocs.14).aspx\"),B169)),\"\")","v":"Get-CsSite"},"Returns information about the sites created as part of your Microsoft Lync Server 2010 infrastructure. Sites represent a collection of Lync Server 2010 pools and are typically designed around geographic regions. Lync Server includes two types of sites: data center sites and remote sites (branch sites).","yes","yes","yes","yes","yes","yes","yes","yes","yes","yes","Get-CsAdminRole | ? {$_.Cmdlets –match \"Get-CsSite\"}"]
["Get-CsStaticRoutingConfiguration","Get-CsStaticRoutingConfiguration",{"$f":"IF(ISTEXT(A170),(HYPERLINK(SUBSTITUTE(HLINK(A170),\".aspx\",\"\")&IF(C$1=2013,\"(v=ocs.15).aspx\",\"(v=ocs.14).aspx\"),A170)),\"\")","v":"Get-CsStaticRoutingConfiguration"},{"$f":"IF(ISTEXT(B170),(HYPERLINK(SUBSTITUTE(HLINK(B170),\".aspx\",\"\")&IF(D$1=2013,\"(v=ocs.15).aspx\",\"(v=ocs.14).aspx\"),B170)),\"\")","v":"Get-CsStaticRoutingConfiguration"},"Returns information about the static routing configuration settings used in your organization.","yes","no","yes","no","no","no","yes","no","yes","no","Get-CsAdminRole | ? {$_.Cmdlets –match \"Get-CsStaticRoutingConfiguration\"}"]
["Get-CsTestDevice","Get-CsTestDevice",{"$f":"IF(ISTEXT(A171),(HYPERLINK(SUBSTITUTE(HLINK(A171),\".aspx\",\"\")&IF(C$1=2013,\"(v=ocs.15).aspx\",\"(v=ocs.14).aspx\"),A171)),\"\")","v":"Get-CsTestDevice"},{"$f":"IF(ISTEXT(B171),(HYPERLINK(SUBSTITUTE(HLINK(B171),\".aspx\",\"\")&IF(D$1=2013,\"(v=ocs.15).aspx\",\"(v=ocs.14).aspx\"),B171)),\"\")","v":"Get-CsTestDevice"},"Retrieves information about the device update management test devices that have been configured for use in your organization. Test devices provide a way for administrators to test firmware updates before those updates are distributed to all the devices in an organization.","yes","no","yes","no","no","no","yes","no","yes","yes","Get-CsAdminRole | ? {$_.Cmdlets –match \"Get-CsTestDevice\"}"]
[null,"Get-CsTestUserCredential",{"$f":"IF(ISTEXT(A172),(HYPERLINK(SUBSTITUTE(HLINK(A172),\".aspx\",\"\")&IF(C$1=2013,\"(v=ocs.15).aspx\",\"(v=ocs.14).aspx\"),A172)),\"\")","v":""},{"$f":"IF(ISTEXT(B172),(HYPERLINK(SUBSTITUTE(HLINK(B172),\".aspx\",\"\")&IF(D$1=2013,\"(v=ocs.15).aspx\",\"(v=ocs.14).aspx\"),B172)),\"\")","v":"Get-CsTestUserCredential"},"Returns information that tells you whether or not a user has been configured as a watcher node test user. Watcher nodes are computers that periodically use Microsoft System Center Operations Manager and Lync Server 2013 synthetic transactions to verify that Lync Server components are working as expected. This cmdlet was introduced in Lync Server 2013.","no","no","no","no","no","no","no","no","no","no","Get-CsAdminRole | ? {$_.Cmdlets –match \"Get-CsTestUserCredential\"}"]
["Get-CsTopology","Get-CsTopology",{"$f":"IF(ISTEXT(A173),(HYPERLINK(SUBSTITUTE(HLINK(A173),\".aspx\",\"\")&IF(C$1=2013,\"(v=ocs.15).aspx\",\"(v=ocs.14).aspx\"),A173)),\"\")","v":"Get-CsTopology"},{"$f":"IF(ISTEXT(B173),(HYPERLINK(SUBSTITUTE(HLINK(B173),\".aspx\",\"\")&IF(D$1=2013,\"(v=ocs.15).aspx\",\"(v=ocs.14).aspx\"),B173)),\"\")","v":"Get-CsTopology"},"Returns information about your Microsoft Lync Server 2010 infrastructure, including internal domains, sites, clusters, computers, services, and back-end instances of SQL Server.","yes","no","yes","no","yes","no","yes","no","yes","no","Get-CsAdminRole | ? {$_.Cmdlets –match \"Get-CsTopology\"}"]
[null,"Get-CsTrunk",{"$f":"IF(ISTEXT(A174),(HYPERLINK(SUBSTITUTE(HLINK(A174),\".aspx\",\"\")&IF(C$1=2013,\"(v=ocs.15).aspx\",\"(v=ocs.14).aspx\"),A174)),\"\")","v":""},{"$f":"IF(ISTEXT(B174),(HYPERLINK(SUBSTITUTE(HLINK(B174),\".aspx\",\"\")&IF(D$1=2013,\"(v=ocs.15).aspx\",\"(v=ocs.14).aspx\"),B174)),\"\")","v":"Get-CsTrunk"},"Returns information about the SIP trunks employed by your organization. SIP trunks connect the Lync Server 2013 Voice over IP phone network with the Public Switched Telephone Network. This cmdlet was introduced in Lync Server 2013.","yes","no","yes","no","no","no","yes","no","yes","yes","Get-CsAdminRole | ? {$_.Cmdlets –match \"Get-CsTrunk\"}"]
["Get-CsTrunkConfiguration","Get-CsTrunkConfiguration",{"$f":"IF(ISTEXT(A175),(HYPERLINK(SUBSTITUTE(HLINK(A175),\".aspx\",\"\")&IF(C$1=2013,\"(v=ocs.15).aspx\",\"(v=ocs.14).aspx\"),A175)),\"\")","v":"Get-CsTrunkConfiguration"},{"$f":"IF(ISTEXT(B175),(HYPERLINK(SUBSTITUTE(HLINK(B175),\".aspx\",\"\")&IF(D$1=2013,\"(v=ocs.15).aspx\",\"(v=ocs.14).aspx\"),B175)),\"\")","v":"Get-CsTrunkConfiguration"},"Retrieves one or more trunk configurations, which describe the settings for a trunking peer entity such as a public switched telephone network (PSTN) gateway, IP-private branch exchange (PBX), or Session Border Controller (SBC) at the service provider.","yes","no","yes","no","no","no","yes","no","yes","yes","Get-CsAdminRole | ? {$_.Cmdlets –match \"Get-CsTrunkConfiguration\"}"]
["Get-CsTrustedApplication","Get-CsTrustedApplication",{"$f":"IF(ISTEXT(A176),(HYPERLINK(SUBSTITUTE(HLINK(A176),\".aspx\",\"\")&IF(C$1=2013,\"(v=ocs.15).aspx\",\"(v=ocs.14).aspx\"),A176)),\"\")","v":"Get-CsTrustedApplication"},{"$f":"IF(ISTEXT(B176),(HYPERLINK(SUBSTITUTE(HLINK(B176),\".aspx\",\"\")&IF(D$1=2013,\"(v=ocs.15).aspx\",\"(v=ocs.14).aspx\"),B176)),\"\")","v":"Get-CsTrustedApplication"},"Retrieves the settings for a trusted application.","yes","no","yes","no","no","no","yes","no","yes","no","Get-CsAdminRole | ? {$_.Cmdlets –match \"Get-CsTrustedApplication\"}"]
["Get-CsTrustedApplicationComputer","Get-CsTrustedApplicationComputer",{"$f":"IF(ISTEXT(A177),(HYPERLINK(SUBSTITUTE(HLINK(A177),\".aspx\",\"\")&IF(C$1=2013,\"(v=ocs.15).aspx\",\"(v=ocs.14).aspx\"),A177)),\"\")","v":"Get-CsTrustedApplicationComputer"},{"$f":"IF(ISTEXT(B177),(HYPERLINK(SUBSTITUTE(HLINK(B177),\".aspx\",\"\")&IF(D$1=2013,\"(v=ocs.15).aspx\",\"(v=ocs.14).aspx\"),B177)),\"\")","v":"Get-CsTrustedApplicationComputer"},"Retrieves information about one or more computers that host trusted applications.","yes","no","no","no","no","no","yes","no","yes","no",{"$f":"\"Get-CsAdminRole | ? {$_.Cmdlets –match \"& CHAR(34) &B177& CHAR(34) &\"}\"","v":"Get-CsAdminRole | ? {$_.Cmdlets –match \"Get-CsTrustedApplicationComputer\"}"}]
["Get-CsTrustedApplicationEndpoint","Get-CsTrustedApplicationEndpoint",{"$f":"IF(ISTEXT(A178),(HYPERLINK(SUBSTITUTE(HLINK(A178),\".aspx\",\"\")&IF(C$1=2013,\"(v=ocs.15).aspx\",\"(v=ocs.14).aspx\"),A178)),\"\")","v":"Get-CsTrustedApplicationEndpoint"},{"$f":"IF(ISTEXT(B178),(HYPERLINK(SUBSTITUTE(HLINK(B178),\".aspx\",\"\")&IF(D$1=2013,\"(v=ocs.15).aspx\",\"(v=ocs.14).aspx\"),B178)),\"\")","v":"Get-CsTrustedApplicationEndpoint"},"Retrieves information about one or more trusted application endpoints.","yes","no","yes","no","no","no","yes","no","yes","no","Get-CsAdminRole | ? {$_.Cmdlets –match \"Get-CsTrustedApplicationEndpoint\"}"]
["Get-CsTrustedApplicationPool","Get-CsTrustedApplicationPool",{"$f":"IF(ISTEXT(A179),(HYPERLINK(SUBSTITUTE(HLINK(A179),\".aspx\",\"\")&IF(C$1=2013,\"(v=ocs.15).aspx\",\"(v=ocs.14).aspx\"),A179)),\"\")","v":"Get-CsTrustedApplicationPool"},{"$f":"IF(ISTEXT(B179),(HYPERLINK(SUBSTITUTE(HLINK(B179),\".aspx\",\"\")&IF(D$1=2013,\"(v=ocs.15).aspx\",\"(v=ocs.14).aspx\"),B179)),\"\")","v":"Get-CsTrustedApplicationPool"},"Retrieves settings for one or more pools that contain the computers that host trusted applications.","yes","no","no","no","no","no","yes","no","yes","no","Get-CsAdminRole | ? {$_.Cmdlets –match \"Get-CsTrustedApplicationPool\"}"]
["Get-CsUCPhoneConfiguration","Get-CsUCPhoneConfiguration",{"$f":"IF(ISTEXT(A180),(HYPERLINK(SUBSTITUTE(HLINK(A180),\".aspx\",\"\")&IF(C$1=2013,\"(v=ocs.15).aspx\",\"(v=ocs.14).aspx\"),A180)),\"\")","v":"Get-CsUCPhoneConfiguration"},{"$f":"IF(ISTEXT(B180),(HYPERLINK(SUBSTITUTE(HLINK(B180),\".aspx\",\"\")&IF(D$1=2013,\"(v=ocs.15).aspx\",\"(v=ocs.14).aspx\"),B180)),\"\")","v":"Get-CsUCPhoneConfiguration"},"Returns information regarding management options for Microsoft Lync 2010 Phone Edition. This includes such things as the required security mode and whether or not the phone should automatically be locked after a specified period of inactivity.","yes","no","yes","no","no","no","yes","no","yes","yes","Get-CsAdminRole | ? {$_.Cmdlets –match \"Get-CsUCPhoneConfiguration\"}"]
["Get-CsUICulture","Get-CsUICulture",{"$f":"IF(ISTEXT(A181),(HYPERLINK(SUBSTITUTE(HLINK(A181),\".aspx\",\"\")&IF(C$1=2013,\"(v=ocs.15).aspx\",\"(v=ocs.14).aspx\"),A181)),\"\")","v":"Get-CsUICulture"},{"$f":"IF(ISTEXT(B181),(HYPERLINK(SUBSTITUTE(HLINK(B181),\".aspx\",\"\")&IF(D$1=2013,\"(v=ocs.15).aspx\",\"(v=ocs.14).aspx\"),B181)),\"\")","v":"Get-CsUICulture"},"Returns information about the culture (that is, the language and regional settings) used by the Lync Server Management Shell.","no","no","no","no","no","no","no","no","no","no","Get-CsAdminRole | ? {$_.Cmdlets –match \"Get-CsUICulture\"}"]
["Get-CsUnassignedNumber","Get-CsUnassignedNumber",{"$f":"IF(ISTEXT(A182),(HYPERLINK(SUBSTITUTE(HLINK(A182),\".aspx\",\"\")&IF(C$1=2013,\"(v=ocs.15).aspx\",\"(v=ocs.14).aspx\"),A182)),\"\")","v":"Get-CsUnassignedNumber"},{"$f":"IF(ISTEXT(B182),(HYPERLINK(SUBSTITUTE(HLINK(B182),\".aspx\",\"\")&IF(D$1=2013,\"(v=ocs.15).aspx\",\"(v=ocs.14).aspx\"),B182)),\"\")","v":"Get-CsUnassignedNumber"},"Retrieves one or more ranges of unassigned numbers and the routing rules that apply to those numbers.","yes","no","yes","no","no","no","yes","no","yes","yes","Get-CsAdminRole | ? {$_.Cmdlets –match \"Get-CsUnassignedNumber\"}"]
["Get-CsUser","Get-CsUser",{"$f":"IF(ISTEXT(A183),(HYPERLINK(SUBSTITUTE(HLINK(A183),\".aspx\",\"\")&IF(C$1=2013,\"(v=ocs.15).aspx\",\"(v=ocs.14).aspx\"),A183)),\"\")","v":"Get-CsUser"},{"$f":"IF(ISTEXT(B183),(HYPERLINK(SUBSTITUTE(HLINK(B183),\".aspx\",\"\")&IF(D$1=2013,\"(v=ocs.15).aspx\",\"(v=ocs.14).aspx\"),B183)),\"\")","v":"Get-CsUser"},"Returns information about all the users in your organization who have been enabled for Microsoft Lync Server 2010 or a previous version of the software (such as Microsoft Office Communications Server 2007 R2).","yes","yes","yes","yes","yes","yes","yes","yes","yes","yes","Get-CsAdminRole | ? {$_.Cmdlets –match \"Get-CsUser\"}"]
["Get-CsUserAcp","Get-CsUserAcp",{"$f":"IF(ISTEXT(A184),(HYPERLINK(SUBSTITUTE(HLINK(A184),\".aspx\",\"\")&IF(C$1=2013,\"(v=ocs.15).aspx\",\"(v=ocs.14).aspx\"),A184)),\"\")","v":"Get-CsUserAcp"},{"$f":"IF(ISTEXT(B184),(HYPERLINK(SUBSTITUTE(HLINK(B184),\".aspx\",\"\")&IF(D$1=2013,\"(v=ocs.15).aspx\",\"(v=ocs.14).aspx\"),B184)),\"\")","v":"Get-CsUserAcp"},"Returns information about the audio conferencing providers assigned to a user or group of users.","yes","no","yes","no","no","no","yes","yes","yes","no","Get-CsAdminRole | ? {$_.Cmdlets –match \"Get-CsUserAcp\"}"]
["Get-CsUserDatabaseState","Get-CsUserDatabaseState",{"$f":"IF(ISTEXT(A185),(HYPERLINK(SUBSTITUTE(HLINK(A185),\".aspx\",\"\")&IF(C$1=2013,\"(v=ocs.15).aspx\",\"(v=ocs.14).aspx\"),A185)),\"\")","v":"Get-CsUserDatabaseState"},{"$f":"IF(ISTEXT(B185),(HYPERLINK(SUBSTITUTE(HLINK(B185),\".aspx\",\"\")&IF(D$1=2013,\"(v=ocs.15).aspx\",\"(v=ocs.14).aspx\"),B185)),\"\")","v":"Get-CsUserDatabaseState"},"Returns information about the online status (True or False) of one or more Microsoft Lync Server 2010 user databases.","yes","no","no","no","no","no","yes","no","yes","no","Get-CsAdminRole | ? {$_.Cmdlets –match \"Get-CsUserDatabaseState\"}"]
["Get-CsUserPoolInfo","Get-CsUserPoolInfo",{"$f":"IF(ISTEXT(A186),(HYPERLINK(SUBSTITUTE(HLINK(A186),\".aspx\",\"\")&IF(C$1=2013,\"(v=ocs.15).aspx\",\"(v=ocs.14).aspx\"),A186)),\"\")","v":"Get-CsUserPoolInfo"},{"$f":"IF(ISTEXT(B186),(HYPERLINK(SUBSTITUTE(HLINK(B186),\".aspx\",\"\")&IF(D$1=2013,\"(v=ocs.15).aspx\",\"(v=ocs.14).aspx\"),B186)),\"\")","v":"Get-CsUserPoolInfo"},"Returns information about the Registrar pool, backup Registrar pool, and User Services pool that a user has been assigned to.","yes","yes","yes","yes","no","yes","yes","yes","yes","yes","Get-CsAdminRole | ? {$_.Cmdlets –match \"Get-CsUserPoolInfo\"}"]
["Get-CsUserReplicatorConfiguration","Get-CsUserReplicatorConfiguration",{"$f":"IF(ISTEXT(A187),(HYPERLINK(SUBSTITUTE(HLINK(A187),\".aspx\",\"\")&IF(C$1=2013,\"(v=ocs.15).aspx\",\"(v=ocs.14).aspx\"),A187)),\"\")","v":"Get-CsUserReplicatorConfiguration"},{"$f":"IF(ISTEXT(B187),(HYPERLINK(SUBSTITUTE(HLINK(B187),\".aspx\",\"\")&IF(D$1=2013,\"(v=ocs.15).aspx\",\"(v=ocs.14).aspx\"),B187)),\"\")","v":"Get-CsUserReplicatorConfiguration"},"Returns information about the User Replicator configuration settings currently employed in your organization. The User Replicator periodically retrieves up-to-date user account information from Active Directory and then synchronizes the new information with the current user data stored by Microsoft Lync Server 2010.","yes","no","yes","no","no","no","yes","no","yes","no","Get-CsAdminRole | ? {$_.Cmdlets –match \"Get-CsUserReplicatorConfiguration\"}"]
["Get-CsUserServicesConfiguration","Get-CsUserServicesConfiguration",{"$f":"IF(ISTEXT(A188),(HYPERLINK(SUBSTITUTE(HLINK(A188),\".aspx\",\"\")&IF(C$1=2013,\"(v=ocs.15).aspx\",\"(v=ocs.14).aspx\"),A188)),\"\")","v":"Get-CsUserServicesConfiguration"},{"$f":"IF(ISTEXT(B188),(HYPERLINK(SUBSTITUTE(HLINK(B188),\".aspx\",\"\")&IF(D$1=2013,\"(v=ocs.15).aspx\",\"(v=ocs.14).aspx\"),B188)),\"\")","v":"Get-CsUserServicesConfiguration"},"Returns information about the User Services configuration settings in use in your organization. The User Services service helps maintain presence information and manage conferencing.","yes","no","yes","no","no","no","yes","no","yes","no","Get-CsAdminRole | ? {$_.Cmdlets –match \"Get-CsUserServicesConfiguration\"}"]
[null,"Get-CsUserServicesPolicy",{"$f":"IF(ISTEXT(A189),(HYPERLINK(SUBSTITUTE(HLINK(A189),\".aspx\",\"\")&IF(C$1=2013,\"(v=ocs.15).aspx\",\"(v=ocs.14).aspx\"),A189)),\"\")","v":""},{"$f":"IF(ISTEXT(B189),(HYPERLINK(SUBSTITUTE(HLINK(B189),\".aspx\",\"\")&IF(D$1=2013,\"(v=ocs.15).aspx\",\"(v=ocs.14).aspx\"),B189)),\"\")","v":"Get-CsUserServicesPolicy"},"Returns information about the User Services policies configured for use in the organization. User Services policies determine whether or not a user's contacts are stored in Lync Server 2013 or in the Unified Contact Store. The Unified Contact Store provides a way for users to maintain a single set of contacts that can be accessed using Lync 2013, Outlook, and/or Outlook Web Access. This cmdlet was introduced in Lync Server 2013.","yes","no","no","no","no","no","yes","no","yes","no","Get-CsAdminRole | ? {$_.Cmdlets –match \"Get-CsUserServicesPolicy\"}"]
["Get-CsVoiceConfiguration","Get-CsVoiceConfiguration",{"$f":"IF(ISTEXT(A190),(HYPERLINK(SUBSTITUTE(HLINK(A190),\".aspx\",\"\")&IF(C$1=2013,\"(v=ocs.15).aspx\",\"(v=ocs.14).aspx\"),A190)),\"\")","v":"Get-CsVoiceConfiguration"},{"$f":"IF(ISTEXT(B190),(HYPERLINK(SUBSTITUTE(HLINK(B190),\".aspx\",\"\")&IF(D$1=2013,\"(v=ocs.15).aspx\",\"(v=ocs.14).aspx\"),B190)),\"\")","v":"Get-CsVoiceConfiguration"},"Retrieves the voice configuration object, which contains a full list of all voice test configurations defined for the Microsoft Lync Server 2010 deployment.","yes","no","yes","no","no","no","yes","no","yes","yes","Get-CsAdminRole | ? {$_.Cmdlets –match \"Get-CsVoiceConfiguration\"}"]
["Get-CsVoicemailReroutingConfiguration","Get-CsVoicemailReroutingConfiguration",{"$f":"IF(ISTEXT(A191),(HYPERLINK(SUBSTITUTE(HLINK(A191),\".aspx\",\"\")&IF(C$1=2013,\"(v=ocs.15).aspx\",\"(v=ocs.14).aspx\"),A191)),\"\")","v":"Get-CsVoicemailReroutingConfiguration"},{"$f":"IF(ISTEXT(B191),(HYPERLINK(SUBSTITUTE(HLINK(B191),\".aspx\",\"\")&IF(D$1=2013,\"(v=ocs.15).aspx\",\"(v=ocs.14).aspx\"),B191)),\"\")","v":"Get-CsVoicemailReroutingConfiguration"},"Retrieves settings that provide public switched telephone network (PSTN) phone numbers to access Exchange Unified Messaging (UM) Subscriber Access and Auto Attendant features.","yes","no","yes","no","no","no","yes","no","yes","yes","Get-CsAdminRole | ? {$_.Cmdlets –match \"Get-CsVoicemailReroutingConfiguration\"}"]
["Get-CsVoiceNormalizationRule","Get-CsVoiceNormalizationRule",{"$f":"IF(ISTEXT(A192),(HYPERLINK(SUBSTITUTE(HLINK(A192),\".aspx\",\"\")&IF(C$1=2013,\"(v=ocs.15).aspx\",\"(v=ocs.14).aspx\"),A192)),\"\")","v":"Get-CsVoiceNormalizationRule"},{"$f":"IF(ISTEXT(B192),(HYPERLINK(SUBSTITUTE(HLINK(B192),\".aspx\",\"\")&IF(D$1=2013,\"(v=ocs.15).aspx\",\"(v=ocs.14).aspx\"),B192)),\"\")","v":"Get-CsVoiceNormalizationRule"},"Returns information about the voice normalization rules used in your organization. Voice normalization rules convert telephone dialing requirements (for example, dialing 9 to access an outside line) to the E.164 phone number format used by Microsoft Lync Server 2010.","yes","no","yes","no","no","no","yes","no","yes","yes","Get-CsAdminRole | ? {$_.Cmdlets –match \"Get-CsVoiceNormalizationRule\"}"]
["Get-CsVoicePolicy","Get-CsVoicePolicy",{"$f":"IF(ISTEXT(A193),(HYPERLINK(SUBSTITUTE(HLINK(A193),\".aspx\",\"\")&IF(C$1=2013,\"(v=ocs.15).aspx\",\"(v=ocs.14).aspx\"),A193)),\"\")","v":"Get-CsVoicePolicy"},{"$f":"IF(ISTEXT(B193),(HYPERLINK(SUBSTITUTE(HLINK(B193),\".aspx\",\"\")&IF(D$1=2013,\"(v=ocs.15).aspx\",\"(v=ocs.14).aspx\"),B193)),\"\")","v":"Get-CsVoicePolicy"},"Returns information about one or more voice policies configured for your organization.","yes","no","yes","no","no","no","yes","yes","yes","yes","Get-CsAdminRole | ? {$_.Cmdlets –match \"Get-CsVoicePolicy\"}"]
["Get-CsVoiceRoute","Get-CsVoiceRoute",{"$f":"IF(ISTEXT(A194),(HYPERLINK(SUBSTITUTE(HLINK(A194),\".aspx\",\"\")&IF(C$1=2013,\"(v=ocs.15).aspx\",\"(v=ocs.14).aspx\"),A194)),\"\")","v":"Get-CsVoiceRoute"},{"$f":"IF(ISTEXT(B194),(HYPERLINK(SUBSTITUTE(HLINK(B194),\".aspx\",\"\")&IF(D$1=2013,\"(v=ocs.15).aspx\",\"(v=ocs.14).aspx\"),B194)),\"\")","v":"Get-CsVoiceRoute"},"Returns information about the voice routes configured for use in an organization.","yes","no","yes","no","no","no","yes","no","yes","yes","Get-CsAdminRole | ? {$_.Cmdlets –match \"Get-CsVoiceRoute\"}"]
[null,"Get-CsVoiceRoutingPolicy",{"$f":"IF(ISTEXT(A195),(HYPERLINK(SUBSTITUTE(HLINK(A195),\".aspx\",\"\")&IF(C$1=2013,\"(v=ocs.15).aspx\",\"(v=ocs.14).aspx\"),A195)),\"\")","v":""},{"$f":"IF(ISTEXT(B195),(HYPERLINK(SUBSTITUTE(HLINK(B195),\".aspx\",\"\")&IF(D$1=2013,\"(v=ocs.15).aspx\",\"(v=ocs.14).aspx\"),B195)),\"\")","v":"Get-CsVoiceRoutingPolicy"},"Returns information about the voice routing policies configured for use in your organization. Voice routing policies manage PSTN usages for users of hybrid voice. Hybrid voice enables users homed on Lync Online to take advantage of the Enterprise Voice capabilities available in an on-premises installation of Lync Server 2013. This cmdlet was introduced in Lync Server 2013.","yes","no","yes","no","no","no","yes","yes","yes","yes","Get-CsAdminRole | ? {$_.Cmdlets –match \"Get-CsVoiceRoutingPolicy\"}"]
["Get-CsVoiceTestConfiguration","Get-CsVoiceTestConfiguration",{"$f":"IF(ISTEXT(A196),(HYPERLINK(SUBSTITUTE(HLINK(A196),\".aspx\",\"\")&IF(C$1=2013,\"(v=ocs.15).aspx\",\"(v=ocs.14).aspx\"),A196)),\"\")","v":"Get-CsVoiceTestConfiguration"},{"$f":"IF(ISTEXT(B196),(HYPERLINK(SUBSTITUTE(HLINK(B196),\".aspx\",\"\")&IF(D$1=2013,\"(v=ocs.15).aspx\",\"(v=ocs.14).aspx\"),B196)),\"\")","v":"Get-CsVoiceTestConfiguration"},"Retrieves a test scenario you can use to test phone numbers against specified routes and rules.","yes","no","yes","no","no","no","yes","no","yes","yes","Get-CsAdminRole | ? {$_.Cmdlets –match \"Get-CsVoiceTestConfiguration\"}"]
[null,"Get-CsWatcherNodeConfiguration",{"$f":"IF(ISTEXT(A197),(HYPERLINK(SUBSTITUTE(HLINK(A197),\".aspx\",\"\")&IF(C$1=2013,\"(v=ocs.15).aspx\",\"(v=ocs.14).aspx\"),A197)),\"\")","v":""},{"$f":"IF(ISTEXT(B197),(HYPERLINK(SUBSTITUTE(HLINK(B197),\".aspx\",\"\")&IF(D$1=2013,\"(v=ocs.15).aspx\",\"(v=ocs.14).aspx\"),B197)),\"\")","v":"Get-CsWatcherNodeConfiguration"},"Returns information about the watcher node configuration settings in use in your organization. Watcher nodes are computers that periodically use Microsoft System Center Operations Manager and Lync Server 2013 synthetic transactions to verify that Lync Server components are working as expected. The watcher node configuration settings let you know which pools have been associated with a watcher node. This cmdlet was introduced in Lync Server 2013.","yes","no","no","no","no","no","yes","no","yes","no","Get-CsAdminRole | ? {$_.Cmdlets –match \"Get-CsWatcherNodeConfiguration\"}"]
["Get-CsWebServiceConfiguration","Get-CsWebServiceConfiguration",{"$f":"IF(ISTEXT(A198),(HYPERLINK(SUBSTITUTE(HLINK(A198),\".aspx\",\"\")&IF(C$1=2013,\"(v=ocs.15).aspx\",\"(v=ocs.14).aspx\"),A198)),\"\")","v":"Get-CsWebServiceConfiguration"},{"$f":"IF(ISTEXT(B198),(HYPERLINK(SUBSTITUTE(HLINK(B198),\".aspx\",\"\")&IF(D$1=2013,\"(v=ocs.15).aspx\",\"(v=ocs.14).aspx\"),B198)),\"\")","v":"Get-CsWebServiceConfiguration"},"Returns information about all the Web Services configuration settings in use in your organization.","yes","no","yes","yes","no","no","yes","no","yes","yes","Get-CsAdminRole | ? {$_.Cmdlets –match \"Get-CsWebServiceConfiguration\"}"]
["Get-CsWindowsService","Get-CsWindowsService",{"$f":"IF(ISTEXT(A199),(HYPERLINK(SUBSTITUTE(HLINK(A199),\".aspx\",\"\")&IF(C$1=2013,\"(v=ocs.15).aspx\",\"(v=ocs.14).aspx\"),A199)),\"\")","v":"Get-CsWindowsService"},{"$f":"IF(ISTEXT(B199),(HYPERLINK(SUBSTITUTE(HLINK(B199),\".aspx\",\"\")&IF(D$1=2013,\"(v=ocs.15).aspx\",\"(v=ocs.14).aspx\"),B199)),\"\")","v":"Get-CsWindowsService"},"Get-CsWindowsService returns detailed information about Microsoft Lync Server 2010 components that run as Windows services.","yes","yes","yes","yes","no","yes","yes","yes","yes","yes","Get-CsAdminRole | ? {$_.Cmdlets –match \"Get-CsWindowsService\"}"]
[null,"Get-CsXmppAllowedPartner",{"$f":"IF(ISTEXT(A200),(HYPERLINK(SUBSTITUTE(HLINK(A200),\".aspx\",\"\")&IF(C$1=2013,\"(v=ocs.15).aspx\",\"(v=ocs.14).aspx\"),A200)),\"\")","v":""},{"$f":"IF(ISTEXT(B200),(HYPERLINK(SUBSTITUTE(HLINK(B200),\".aspx\",\"\")&IF(D$1=2013,\"(v=ocs.15).aspx\",\"(v=ocs.14).aspx\"),B200)),\"\")","v":"Get-CsXmppAllowedPartner"},"Returns information about XMPP partners authorized to communicate with your organization. The extensible Messaging and Presence Protocol (XMPP) is an open-standard communications protocol for exchanging messages using XML. Allowed partners are IM and presence providers that have been authorized to exchange instant messages and presence information with your Lync Server 2013 users. This cmdlet was introduced in Lync Server 2013.","yes","no","yes","no","no","no","yes","no","yes","no",{"$f":"\"Get-CsAdminRole | ? {$_.Cmdlets –match \"& CHAR(34) &B200& CHAR(34) &\"}\"","v":"Get-CsAdminRole | ? {$_.Cmdlets –match \"Get-CsXmppAllowedPartner\"}"}]
[null,"Get-CsXmppGatewayConfiguration",{"$f":"IF(ISTEXT(A201),(HYPERLINK(SUBSTITUTE(HLINK(A201),\".aspx\",\"\")&IF(C$1=2013,\"(v=ocs.15).aspx\",\"(v=ocs.14).aspx\"),A201)),\"\")","v":""},{"$f":"IF(ISTEXT(B201),(HYPERLINK(SUBSTITUTE(HLINK(B201),\".aspx\",\"\")&IF(D$1=2013,\"(v=ocs.15).aspx\",\"(v=ocs.14).aspx\"),B201)),\"\")","v":"Get-CsXmppGatewayConfiguration"},"Returns information about the XMPP gateway configuration settings in use in the organization. The extensible Messaging and Presence Protocol (XMPP) is an open-standard communications protocol for exchanging messages using XML. XMPP gateways enable Lync Server 2013 users to exchange instant message and presence information with users belonging to IM and presence providers that employ XMPP. This cmdlet was introduced in Lync Server 2013.","yes","no","yes","no","no","no","yes","no","yes","no","Get-CsAdminRole | ? {$_.Cmdlets –match \"Get-CsXmppGatewayConfiguration\"}"]
["Grant-CsArchivingPolicy","Grant-CsArchivingPolicy",{"$f":"IF(ISTEXT(A202),(HYPERLINK(SUBSTITUTE(HLINK(A202),\".aspx\",\"\")&IF(C$1=2013,\"(v=ocs.15).aspx\",\"(v=ocs.14).aspx\"),A202)),\"\")","v":"Grant-CsArchivingPolicy"},{"$f":"IF(ISTEXT(B202),(HYPERLINK(SUBSTITUTE(HLINK(B202),\".aspx\",\"\")&IF(D$1=2013,\"(v=ocs.15).aspx\",\"(v=ocs.14).aspx\"),B202)),\"\")","v":"Grant-CsArchivingPolicy"},"Enables you to assign instant messaging (IM) session archiving policies to users or sets of users. These policies give you the ability to archive all IM sessions that take place between internal users, and/or to archive all IM sessions that take place between internal users and external partners.","yes","yes","no","no","no","no","no","no","no","no","Get-CsAdminRole | ? {$_.Cmdlets –match \"Grant-CsArchivingPolicy\"}"]
["Grant-CsClientPolicy","Grant-CsClientPolicy",{"$f":"IF(ISTEXT(A203),(HYPERLINK(SUBSTITUTE(HLINK(A203),\".aspx\",\"\")&IF(C$1=2013,\"(v=ocs.15).aspx\",\"(v=ocs.14).aspx\"),A203)),\"\")","v":"Grant-CsClientPolicy"},{"$f":"IF(ISTEXT(B203),(HYPERLINK(SUBSTITUTE(HLINK(B203),\".aspx\",\"\")&IF(D$1=2013,\"(v=ocs.15).aspx\",\"(v=ocs.14).aspx\"),B203)),\"\")","v":"Grant-CsClientPolicy"},"Assigns a client policy to a user or a group of users. Among other things, client policies help determine the features of Microsoft Lync 2010 that are available to users; for example, you might give some users the right to transfer files while denying this right to other users.","yes","no","no","no","no","no","no","yes","no","no","Get-CsAdminRole | ? {$_.Cmdlets –match \"Grant-CsClientPolicy\"}"]
["Grant-CsClientVersionPolicy","Grant-CsClientVersionPolicy",{"$f":"IF(ISTEXT(A204),(HYPERLINK(SUBSTITUTE(HLINK(A204),\".aspx\",\"\")&IF(C$1=2013,\"(v=ocs.15).aspx\",\"(v=ocs.14).aspx\"),A204)),\"\")","v":"Grant-CsClientVersionPolicy"},{"$f":"IF(ISTEXT(B204),(HYPERLINK(SUBSTITUTE(HLINK(B204),\".aspx\",\"\")&IF(D$1=2013,\"(v=ocs.15).aspx\",\"(v=ocs.14).aspx\"),B204)),\"\")","v":"Grant-CsClientVersionPolicy"},"Assigns a client version policy at the global, site, service, or per-user scope. Client version policies enable you to specify which clients (such as Microsoft Office Communicator 2007 R2) will be able to log on to your Microsoft Lync Server 2010 system.","yes","no","no","no","no","no","no","yes","no","no","Get-CsAdminRole | ? {$_.Cmdlets –match \"Grant-CsClientVersionPolicy\"}"]
["Grant-CsConferencingPolicy","Grant-CsConferencingPolicy",{"$f":"IF(ISTEXT(A205),(HYPERLINK(SUBSTITUTE(HLINK(A205),\".aspx\",\"\")&IF(C$1=2013,\"(v=ocs.15).aspx\",\"(v=ocs.14).aspx\"),A205)),\"\")","v":"Grant-CsConferencingPolicy"},{"$f":"IF(ISTEXT(B205),(HYPERLINK(SUBSTITUTE(HLINK(B205),\".aspx\",\"\")&IF(D$1=2013,\"(v=ocs.15).aspx\",\"(v=ocs.14).aspx\"),B205)),\"\")","v":"Grant-CsConferencingPolicy"},"Assigns a conferencing policy at the per-user scope. Conferencing policies determine the features and capabilities that can be used in a conference. This includes everything from whether or not the meeting can include IP audio and video to the maximum number of people who can attend a meeting.","yes","no","no","no","no","no","no","yes","no","no","Get-CsAdminRole | ? {$_.Cmdlets –match \"Grant-CsConferencingPolicy\"}"]
["Grant-CsDialPlan","Grant-CsDialPlan",{"$f":"IF(ISTEXT(A206),(HYPERLINK(SUBSTITUTE(HLINK(A206),\".aspx\",\"\")&IF(C$1=2013,\"(v=ocs.15).aspx\",\"(v=ocs.14).aspx\"),A206)),\"\")","v":"Grant-CsDialPlan"},{"$f":"IF(ISTEXT(B206),(HYPERLINK(SUBSTITUTE(HLINK(B206),\".aspx\",\"\")&IF(D$1=2013,\"(v=ocs.15).aspx\",\"(v=ocs.14).aspx\"),B206)),\"\")","v":"Grant-CsDialPlan"},"Assigns a dial plan to one or more users or groups.","yes","no","no","no","no","no","no","yes","no","yes","Get-CsAdminRole | ? {$_.Cmdlets –match \"Grant-CsDialPlan\"}"]
["Grant-CsExternalAccessPolicy","Grant-CsExternalAccessPolicy",{"$f":"IF(ISTEXT(A207),(HYPERLINK(SUBSTITUTE(HLINK(A207),\".aspx\",\"\")&IF(C$1=2013,\"(v=ocs.15).aspx\",\"(v=ocs.14).aspx\"),A207)),\"\")","v":"Grant-CsExternalAccessPolicy"},{"$f":"IF(ISTEXT(B207),(HYPERLINK(SUBSTITUTE(HLINK(B207),\".aspx\",\"\")&IF(D$1=2013,\"(v=ocs.15).aspx\",\"(v=ocs.14).aspx\"),B207)),\"\")","v":"Grant-CsExternalAccessPolicy"},"Enables you to assign an external access policy to a user or a group of users. External access policies determine whether or not your users can: 1) communicate with users who have Session Initiation Protocol (SIP) accounts with a federated organization; 2) communicate with users who have SIP accounts with a public instant messaging (IM) provider such as MSN; and, 3) access Microsoft Lync Server 2010 over the Internet, without having to log on to your internal network.","yes","no","no","no","no","no","no","yes","no","no","Get-CsAdminRole | ? {$_.Cmdlets –match \"Grant-CsExternalAccessPolicy\"}"]
["Grant-CsHostedVoicemailPolicy","Grant-CsHostedVoicemailPolicy",{"$f":"IF(ISTEXT(A208),(HYPERLINK(SUBSTITUTE(HLINK(A208),\".aspx\",\"\")&IF(C$1=2013,\"(v=ocs.15).aspx\",\"(v=ocs.14).aspx\"),A208)),\"\")","v":"Grant-CsHostedVoicemailPolicy"},{"$f":"IF(ISTEXT(B208),(HYPERLINK(SUBSTITUTE(HLINK(B208),\".aspx\",\"\")&IF(D$1=2013,\"(v=ocs.15).aspx\",\"(v=ocs.14).aspx\"),B208)),\"\")","v":"Grant-CsHostedVoicemailPolicy"},"Assigns a hosted voice mail policy at the per-user scope. (The per-user scope enables you to assign policies to individual users or groups.)","yes","no","no","no","no","no","no","yes","no","yes","Get-CsAdminRole | ? {$_.Cmdlets –match \"Grant-CsHostedVoicemailPolicy\"}"]
["Grant-CsLocationPolicy","Grant-CsLocationPolicy",{"$f":"IF(ISTEXT(A209),(HYPERLINK(SUBSTITUTE(HLINK(A209),\".aspx\",\"\")&IF(C$1=2013,\"(v=ocs.15).aspx\",\"(v=ocs.14).aspx\"),A209)),\"\")","v":"Grant-CsLocationPolicy"},{"$f":"IF(ISTEXT(B209),(HYPERLINK(SUBSTITUTE(HLINK(B209),\".aspx\",\"\")&IF(D$1=2013,\"(v=ocs.15).aspx\",\"(v=ocs.14).aspx\"),B209)),\"\")","v":"Grant-CsLocationPolicy"},"Assigns an Enhanced 9-1-1 (E9-1-1) location policy to individual users or groups. The E9-1-1 service enables those who answer 911 calls to determine the caller's geographic location.","yes","no","no","yes","no","no","no","yes","no","yes","Get-CsAdminRole | ? {$_.Cmdlets –match \"Grant-CsLocationPolicy\"}"]
["Grant-CsMobilityPolicy","Grant-CsMobilityPolicy",{"$f":"IF(ISTEXT(A210),(HYPERLINK(SUBSTITUTE(HLINK(A210),\".aspx\",\"\")&IF(C$1=2013,\"(v=ocs.15).aspx\",\"(v=ocs.14).aspx\"),A210)),\"\")","v":"Grant-CsMobilityPolicy"},{"$f":"IF(ISTEXT(B210),(HYPERLINK(SUBSTITUTE(HLINK(B210),\".aspx\",\"\")&IF(D$1=2013,\"(v=ocs.15).aspx\",\"(v=ocs.14).aspx\"),B210)),\"\")","v":"Grant-CsMobilityPolicy"},"Grants a per-user mobility policy to a user or group of users. Mobility policies determine whether or not a user can use Lync Mobile. These policies also manage a user's ability to employ Call via Work, a feature that enables users to make and receive phone calls on their mobile phone by using their work phone number instead of their mobile phone number. Mobility policies can also be used to require Wi-Fi connections when making or receiving calls. This cmdlet was introduced in the cumulative update for Lync Server 2010: November 2011.","yes","no","no","no","no","no","no","yes","no","no","Get-CsAdminRole | ? {$_.Cmdlets –match \"Grant-CsMobilityPolicy\"}"]
["Grant-CsOUPermission","Grant-CsOUPermission",{"$f":"IF(ISTEXT(A211),(HYPERLINK(SUBSTITUTE(HLINK(A211),\".aspx\",\"\")&IF(C$1=2013,\"(v=ocs.15).aspx\",\"(v=ocs.14).aspx\"),A211)),\"\")","v":"Grant-CsOUPermission"},{"$f":"IF(ISTEXT(B211),(HYPERLINK(SUBSTITUTE(HLINK(B211),\".aspx\",\"\")&IF(D$1=2013,\"(v=ocs.15).aspx\",\"(v=ocs.14).aspx\"),B211)),\"\")","v":"Grant-CsOUPermission"},"Grants Microsoft Lync Server 2010 management permissions on an Active Directory organizational unit (OU).","no","no","no","no","no","no","no","no","no","no","Get-CsAdminRole | ? {$_.Cmdlets –match \"Grant-CsOUPermission\"}"]
[null,"Grant-CsPersistentChatPolicy",{"$f":"IF(ISTEXT(A212),(HYPERLINK(SUBSTITUTE(HLINK(A212),\".aspx\",\"\")&IF(C$1=2013,\"(v=ocs.15).aspx\",\"(v=ocs.14).aspx\"),A212)),\"\")","v":""},{"$f":"IF(ISTEXT(B212),(HYPERLINK(SUBSTITUTE(HLINK(B212),\".aspx\",\"\")&IF(D$1=2013,\"(v=ocs.15).aspx\",\"(v=ocs.14).aspx\"),B212)),\"\")","v":"Grant-CsPersistentChatPolicy"},"Assigns a per-user Persistent Chat policy to a user. Persistent Chat policies determine whether or not users are allowed access to Persistent Chat chat rooms. This cmdlet was introduced in Lync Server 2013.","yes","no","no","no","yes","no","no","yes","no","no","Get-CsAdminRole | ? {$_.Cmdlets –match \"Grant-CsPersistentChatPolicy\"}"]
["Grant-CsPinPolicy","Grant-CsPinPolicy",{"$f":"IF(ISTEXT(A213),(HYPERLINK(SUBSTITUTE(HLINK(A213),\".aspx\",\"\")&IF(C$1=2013,\"(v=ocs.15).aspx\",\"(v=ocs.14).aspx\"),A213)),\"\")","v":"Grant-CsPinPolicy"},{"$f":"IF(ISTEXT(B213),(HYPERLINK(SUBSTITUTE(HLINK(B213),\".aspx\",\"\")&IF(D$1=2013,\"(v=ocs.15).aspx\",\"(v=ocs.14).aspx\"),B213)),\"\")","v":"Grant-CsPinPolicy"},"Assigns a client personal identification number (PIN) policy to a user or group of users. PIN authentication enables users to access Microsoft Lync Server 2010 by providing a PIN instead of a user name and password.","yes","no","no","no","no","no","no","yes","no","no","Get-CsAdminRole | ? {$_.Cmdlets –match \"Grant-CsPinPolicy\"}"]
["Grant-CsPresencePolicy","Grant-CsPresencePolicy",{"$f":"IF(ISTEXT(A214),(HYPERLINK(SUBSTITUTE(HLINK(A214),\".aspx\",\"\")&IF(C$1=2013,\"(v=ocs.15).aspx\",\"(v=ocs.14).aspx\"),A214)),\"\")","v":"Grant-CsPresencePolicy"},{"$f":"IF(ISTEXT(B214),(HYPERLINK(SUBSTITUTE(HLINK(B214),\".aspx\",\"\")&IF(D$1=2013,\"(v=ocs.15).aspx\",\"(v=ocs.14).aspx\"),B214)),\"\")","v":"Grant-CsPresencePolicy"},"Grants a per-user presence policy to a user or group of users.","yes","no","no","no","no","no","no","yes","no","no","Get-CsAdminRole | ? {$_.Cmdlets –match \"Grant-CsPresencePolicy\"}"]
["Grant-CsSetupPermission","Grant-CsSetupPermission",{"$f":"IF(ISTEXT(A215),(HYPERLINK(SUBSTITUTE(HLINK(A215),\".aspx\",\"\")&IF(C$1=2013,\"(v=ocs.15).aspx\",\"(v=ocs.14).aspx\"),A215)),\"\")","v":"Grant-CsSetupPermission"},{"$f":"IF(ISTEXT(B215),(HYPERLINK(SUBSTITUTE(HLINK(B215),\".aspx\",\"\")&IF(D$1=2013,\"(v=ocs.15).aspx\",\"(v=ocs.14).aspx\"),B215)),\"\")","v":"Grant-CsSetupPermission"},"Grants Microsoft Lync Server 2010 setup permissions on an Active Directory organizational unit (OU).","no","no","no","no","no","no","no","no","no","no","Get-CsAdminRole | ? {$_.Cmdlets –match \"Grant-CsSetupPermission\"}"]
[null,"Grant-CsUserServicesPolicy",{"$f":"IF(ISTEXT(A216),(HYPERLINK(SUBSTITUTE(HLINK(A216),\".aspx\",\"\")&IF(C$1=2013,\"(v=ocs.15).aspx\",\"(v=ocs.14).aspx\"),A216)),\"\")","v":""},{"$f":"IF(ISTEXT(B216),(HYPERLINK(SUBSTITUTE(HLINK(B216),\".aspx\",\"\")&IF(D$1=2013,\"(v=ocs.15).aspx\",\"(v=ocs.14).aspx\"),B216)),\"\")","v":"Grant-CsUserServicesPolicy"},"Assigns a per-user User Services policy to one or more users. User Services policies determine whether or not a user's contacts are stored in Lync Server 2013 or in the Unified Contact Store. The Unified Contact Store provides a way for users to maintain a single set of contacts that can be accessed using Lync 2013, Microsoft Outlook, and/or Microsoft Outlook Web Access. This cmdlet was introduced in Lync Server 2013.","yes","no","no","no","no","no","no","yes","no","no","Get-CsAdminRole | ? {$_.Cmdlets –match \"Grant-CsUserServicesPolicy\"}"]
["Grant-CsVoicePolicy","Grant-CsVoicePolicy",{"$f":"IF(ISTEXT(A217),(HYPERLINK(SUBSTITUTE(HLINK(A217),\".aspx\",\"\")&IF(C$1=2013,\"(v=ocs.15).aspx\",\"(v=ocs.14).aspx\"),A217)),\"\")","v":"Grant-CsVoicePolicy"},{"$f":"IF(ISTEXT(B217),(HYPERLINK(SUBSTITUTE(HLINK(B217),\".aspx\",\"\")&IF(D$1=2013,\"(v=ocs.15).aspx\",\"(v=ocs.14).aspx\"),B217)),\"\")","v":"Grant-CsVoicePolicy"},"Assigns a voice policy to one or more users or groups.","yes","no","no","no","no","no","no","yes","no","yes","Get-CsAdminRole | ? {$_.Cmdlets –match \"Grant-CsVoicePolicy\"}"]
[null,"Grant-CsVoiceRoutingPolicy",{"$f":"IF(ISTEXT(A218),(HYPERLINK(SUBSTITUTE(HLINK(A218),\".aspx\",\"\")&IF(C$1=2013,\"(v=ocs.15).aspx\",\"(v=ocs.14).aspx\"),A218)),\"\")","v":""},{"$f":"IF(ISTEXT(B218),(HYPERLINK(SUBSTITUTE(HLINK(B218),\".aspx\",\"\")&IF(D$1=2013,\"(v=ocs.15).aspx\",\"(v=ocs.14).aspx\"),B218)),\"\")","v":"Grant-CsVoiceRoutingPolicy"},"Assigns a per-user voice routing policy to one or more users. Voice routing policies manage PSTN usages for users of hybrid voice. Hybrid voice enables users homed on Lync Online to take advantage of the Enterprise Voice capabilities available in an on-premises installation of Lync Server 2013. This cmdlet was introduced in Lync Server 2013.","yes","no","no","no","no","no","no","yes","no","yes",{"$f":"\"Get-CsAdminRole | ? {$_.Cmdlets –match \"& CHAR(34) &B218& CHAR(34) &\"}\"","v":"Get-CsAdminRole | ? {$_.Cmdlets –match \"Grant-CsVoiceRoutingPolicy\"}"}]
["Import-CSAnnouncementFile","Import-CsAnnouncementFile",{"$f":"IF(ISTEXT(A219),(HYPERLINK(SUBSTITUTE(HLINK(A219),\".aspx\",\"\")&IF(C$1=2013,\"(v=ocs.15).aspx\",\"(v=ocs.14).aspx\"),A219)),\"\")","v":"Import-CSAnnouncementFile"},{"$f":"IF(ISTEXT(B219),(HYPERLINK(SUBSTITUTE(HLINK(B219),\".aspx\",\"\")&IF(D$1=2013,\"(v=ocs.15).aspx\",\"(v=ocs.14).aspx\"),B219)),\"\")","v":"Import-CsAnnouncementFile"},"Imports an announcement file to the Announcement service audio library.","yes","no","no","no","no","no","yes","no","no","yes","Get-CsAdminRole | ? {$_.Cmdlets –match \"Import-CsAnnouncementFile\"}"]
["Import-CsCertificate","Import-CsCertificate",{"$f":"IF(ISTEXT(A220),(HYPERLINK(SUBSTITUTE(HLINK(A220),\".aspx\",\"\")&IF(C$1=2013,\"(v=ocs.15).aspx\",\"(v=ocs.14).aspx\"),A220)),\"\")","v":"Import-CsCertificate"},{"$f":"IF(ISTEXT(B220),(HYPERLINK(SUBSTITUTE(HLINK(B220),\".aspx\",\"\")&IF(D$1=2013,\"(v=ocs.15).aspx\",\"(v=ocs.14).aspx\"),B220)),\"\")","v":"Import-CsCertificate"},"Imports a certificate for use with Microsoft Lync Server 2010. If a certificate is not acquired by using the Request-CsCertificate cmdlet, then that certificate must be imported before it can be assigned to a Lync Server 2010 server role.","no","no","no","no","no","no","no","no","no","no","Get-CsAdminRole | ? {$_.Cmdlets –match \"Import-CsCertificate\"}"]
["Import-CsConfiguration","Import-CsConfiguration",{"$f":"IF(ISTEXT(A221),(HYPERLINK(SUBSTITUTE(HLINK(A221),\".aspx\",\"\")&IF(C$1=2013,\"(v=ocs.15).aspx\",\"(v=ocs.14).aspx\"),A221)),\"\")","v":"Import-CsConfiguration"},{"$f":"IF(ISTEXT(B221),(HYPERLINK(SUBSTITUTE(HLINK(B221),\".aspx\",\"\")&IF(D$1=2013,\"(v=ocs.15).aspx\",\"(v=ocs.14).aspx\"),B221)),\"\")","v":"Import-CsConfiguration"},"Imports your Microsoft Lync Server 2010 topology, policies, and configuration settings to either the Central Management store or to the local computer.","yes","no","no","no","no","no","yes","no","no","no","Get-CsAdminRole | ? {$_.Cmdlets –match \"Import-CsConfiguration\"}"]
["Import-CsDeviceUpdate","Import-CsDeviceUpdate",{"$f":"IF(ISTEXT(A222),(HYPERLINK(SUBSTITUTE(HLINK(A222),\".aspx\",\"\")&IF(C$1=2013,\"(v=ocs.15).aspx\",\"(v=ocs.14).aspx\"),A222)),\"\")","v":"Import-CsDeviceUpdate"},{"$f":"IF(ISTEXT(B222),(HYPERLINK(SUBSTITUTE(HLINK(B222),\".aspx\",\"\")&IF(D$1=2013,\"(v=ocs.15).aspx\",\"(v=ocs.14).aspx\"),B222)),\"\")","v":"Import-CsDeviceUpdate"},"Imports a set of device update rules downloaded from Microsoft.com. Device update rules associate firmware version updates with hardware devices running Microsoft Lync 2010 Phone Edition.","no","no","no","no","no","no","no","no","no","no","Get-CsAdminRole | ? {$_.Cmdlets –match \"Import-CsDeviceUpdate\"}"]
["Import-CsLegacyConferenceDirectory","Import-CsLegacyConferenceDirectory",{"$f":"IF(ISTEXT(A223),(HYPERLINK(SUBSTITUTE(HLINK(A223),\".aspx\",\"\")&IF(C$1=2013,\"(v=ocs.15).aspx\",\"(v=ocs.14).aspx\"),A223)),\"\")","v":"Import-CsLegacyConferenceDirectory"},{"$f":"IF(ISTEXT(B223),(HYPERLINK(SUBSTITUTE(HLINK(B223),\".aspx\",\"\")&IF(D$1=2013,\"(v=ocs.15).aspx\",\"(v=ocs.14).aspx\"),B223)),\"\")","v":"Import-CsLegacyConferenceDirectory"},"Import-CsLegacyConferenceDirectory enables you to import conference directories from Microsoft Office Communications Server 2007 R2 to Microsoft Lync Server 2010. This helps provide interoperability between Lync Server 2010 and Office Communications Server 2007 R2.","no","no","no","no","no","no","no","no","no","no","Get-CsAdminRole | ? {$_.Cmdlets –match \"Import-CsLegacyConferenceDirectory\"}"]
["Import-CsLegacyConfiguration","Import-CsLegacyConfiguration",{"$f":"IF(ISTEXT(A224),(HYPERLINK(SUBSTITUTE(HLINK(A224),\".aspx\",\"\")&IF(C$1=2013,\"(v=ocs.15).aspx\",\"(v=ocs.14).aspx\"),A224)),\"\")","v":"Import-CsLegacyConfiguration"},{"$f":"IF(ISTEXT(B224),(HYPERLINK(SUBSTITUTE(HLINK(B224),\".aspx\",\"\")&IF(D$1=2013,\"(v=ocs.15).aspx\",\"(v=ocs.14).aspx\"),B224)),\"\")","v":"Import-CsLegacyConfiguration"},"Import-CsLegacyConfiguration enables you to import a number of configuration settings from Microsoft Office Communications Server 2007 R2 or Microsoft Office Communications Server 2007 to Microsoft Lync Server 2010. This helps provide interoperability between Lync Server 2010 and your earlier installation of Office Communications Server 2007 R2 or Office Communications Server 2007.","no","no","no","no","no","no","no","no","no","no","Get-CsAdminRole | ? {$_.Cmdlets –match \"Import-CsLegacyConfiguration\"}"]
["Import-CsLisConfiguration","Import-CsLisConfiguration",{"$f":"IF(ISTEXT(A225),(HYPERLINK(SUBSTITUTE(HLINK(A225),\".aspx\",\"\")&IF(C$1=2013,\"(v=ocs.15).aspx\",\"(v=ocs.14).aspx\"),A225)),\"\")","v":"Import-CsLisConfiguration"},{"$f":"IF(ISTEXT(B225),(HYPERLINK(SUBSTITUTE(HLINK(B225),\".aspx\",\"\")&IF(D$1=2013,\"(v=ocs.15).aspx\",\"(v=ocs.14).aspx\"),B225)),\"\")","v":"Import-CsLisConfiguration"},"Imports an Enterprise Voice Enhanced 9-1-1 (E9-1-1) configuration from a backup file.","yes","no","no","yes","no","no","yes","no","no","yes","Get-CsAdminRole | ? {$_.Cmdlets –match \"Import-CsLisConfiguration\"}"]
[null,"Import-CsPersistentChatData",{"$f":"IF(ISTEXT(A226),(HYPERLINK(SUBSTITUTE(HLINK(A226),\".aspx\",\"\")&IF(C$1=2013,\"(v=ocs.15).aspx\",\"(v=ocs.14).aspx\"),A226)),\"\")","v":""},{"$f":"IF(ISTEXT(B226),(HYPERLINK(SUBSTITUTE(HLINK(B226),\".aspx\",\"\")&IF(D$1=2013,\"(v=ocs.15).aspx\",\"(v=ocs.14).aspx\"),B226)),\"\")","v":"Import-CsPersistentChatData"},"Enables administrators to import data exported from a Microsoft Lync Server 2010 Group Chat database into a Lync Server 2013 Persistent Chat database. This data must have previously been exported from the Group Chat database by using the Export-CsPersistentChatData cmdlet. This cmdlet was introduced in Lync Server 2013.","yes","no","no","no","yes","no","yes","no","no","no","Get-CsAdminRole | ? {$_.Cmdlets –match \"Import-CsPersistentChatData\"}"]
["Import-CsRgsAudioFile","Import-CsRgsAudioFile",{"$f":"IF(ISTEXT(A227),(HYPERLINK(SUBSTITUTE(HLINK(A227),\".aspx\",\"\")&IF(C$1=2013,\"(v=ocs.15).aspx\",\"(v=ocs.14).aspx\"),A227)),\"\")","v":"Import-CsRgsAudioFile"},{"$f":"IF(ISTEXT(B227),(HYPERLINK(SUBSTITUTE(HLINK(B227),\".aspx\",\"\")&IF(D$1=2013,\"(v=ocs.15).aspx\",\"(v=ocs.14).aspx\"),B227)),\"\")","v":"Import-CsRgsAudioFile"},"Imports a new audio file for use with the Response Group application.","yes","no","no","no","no","yes","yes","no","no","yes","Get-CsAdminRole | ? {$_.Cmdlets –match \"Import-CsRgsAudioFile\"}"]
[null,"Import-CsRgsConfiguration",{"$f":"IF(ISTEXT(A228),(HYPERLINK(SUBSTITUTE(HLINK(A228),\".aspx\",\"\")&IF(C$1=2013,\"(v=ocs.15).aspx\",\"(v=ocs.14).aspx\"),A228)),\"\")","v":""},{"$f":"IF(ISTEXT(B228),(HYPERLINK(SUBSTITUTE(HLINK(B228),\".aspx\",\"\")&IF(D$1=2013,\"(v=ocs.15).aspx\",\"(v=ocs.14).aspx\"),B228)),\"\")","v":"Import-CsRgsConfiguration"},"Imports Response Group configuration data that was previously exported using the Export-CsRgsConfiguration cmdlet. The ability to export and import Response Group configuration data is particularly useful disaster recovery scenarios.","no","no","no","no","no","no","no","no","no","no","Get-CsAdminRole | ? {$_.Cmdlets –match \"Import-CsRgsConfiguration\"}"]
[null,"Import-CsUserData",{"$f":"IF(ISTEXT(A229),(HYPERLINK(SUBSTITUTE(HLINK(A229),\".aspx\",\"\")&IF(C$1=2013,\"(v=ocs.15).aspx\",\"(v=ocs.14).aspx\"),A229)),\"\")","v":""},{"$f":"IF(ISTEXT(B229),(HYPERLINK(SUBSTITUTE(HLINK(B229),\".aspx\",\"\")&IF(D$1=2013,\"(v=ocs.15).aspx\",\"(v=ocs.14).aspx\"),B229)),\"\")","v":"Import-CsUserData"},"Imports user data previously exported by using the Export-CsUserData cmdlet. This cmdlet was introduced in Lync Server 2013.","yes","no","no","no","no","no","yes","yes","no","no","Get-CsAdminRole | ? {$_.Cmdlets –match \"Import-CsUserData\"}"]
["Install-CsAdServerSchema","Install-CsAdServerSchema",{"$f":"IF(ISTEXT(A230),(HYPERLINK(SUBSTITUTE(HLINK(A230),\".aspx\",\"\")&IF(C$1=2013,\"(v=ocs.15).aspx\",\"(v=ocs.14).aspx\"),A230)),\"\")","v":"Install-CsAdServerSchema"},{"$f":"IF(ISTEXT(B230),(HYPERLINK(SUBSTITUTE(HLINK(B230),\".aspx\",\"\")&IF(D$1=2013,\"(v=ocs.15).aspx\",\"(v=ocs.14).aspx\"),B230)),\"\")","v":"Install-CsAdServerSchema"},"Extends the Active Directory schema to allow for the installation of Microsoft Lync Server 2010.","no","no","no","no","no","no","no","no","no","no","Get-CsAdminRole | ? {$_.Cmdlets –match \"Install-CsAdServerSchema\"}"]
["Install-CsDatabase","Install-CsDatabase",{"$f":"IF(ISTEXT(A231),(HYPERLINK(SUBSTITUTE(HLINK(A231),\".aspx\",\"\")&IF(C$1=2013,\"(v=ocs.15).aspx\",\"(v=ocs.14).aspx\"),A231)),\"\")","v":"Install-CsDatabase"},{"$f":"IF(ISTEXT(B231),(HYPERLINK(SUBSTITUTE(HLINK(B231),\".aspx\",\"\")&IF(D$1=2013,\"(v=ocs.15).aspx\",\"(v=ocs.14).aspx\"),B231)),\"\")","v":"Install-CsDatabase"},"Installs one or more Microsoft Lync Server 2010 databases.","no","no","no","no","no","no","no","no","no","no","Get-CsAdminRole | ? {$_.Cmdlets –match \"Install-CsDatabase\"}"]
[null,"Install-CsMirrorDatabase",{"$f":"IF(ISTEXT(A232),(HYPERLINK(SUBSTITUTE(HLINK(A232),\".aspx\",\"\")&IF(C$1=2013,\"(v=ocs.15).aspx\",\"(v=ocs.14).aspx\"),A232)),\"\")","v":""},{"$f":"IF(ISTEXT(B232),(HYPERLINK(SUBSTITUTE(HLINK(B232),\".aspx\",\"\")&IF(D$1=2013,\"(v=ocs.15).aspx\",\"(v=ocs.14).aspx\"),B232)),\"\")","v":"Install-CsMirrorDatabase"},"Associates a mirror database with a Lync Server 2013 database. A database mirror enables you to simultaneously maintain two copies of a database, each copy residing on a different server. This cmdlet was introduced in Lync Server 2013.","no","no","no","no","no","no","no","no","no","no",{"$f":"\"Get-CsAdminRole | ? {$_.Cmdlets –match \"& CHAR(34) &B232& CHAR(34) &\"}\"","v":"Get-CsAdminRole | ? {$_.Cmdlets –match \"Install-CsMirrorDatabase\"}"}]
[null,"Invoke-CsArchivingDatabasePurge",{"$f":"IF(ISTEXT(A233),(HYPERLINK(SUBSTITUTE(HLINK(A233),\".aspx\",\"\")&IF(C$1=2013,\"(v=ocs.15).aspx\",\"(v=ocs.14).aspx\"),A233)),\"\")","v":""},{"$f":"IF(ISTEXT(B233),(HYPERLINK(SUBSTITUTE(HLINK(B233),\".aspx\",\"\")&IF(D$1=2013,\"(v=ocs.15).aspx\",\"(v=ocs.14).aspx\"),B233)),\"\")","v":"Invoke-CsArchivingDatabasePurge"},"Manually purges records from the Archiving database. This cmdlet was introduced in Lync Server 2013.","yes","yes","no","no","no","no","yes","no","no","no","Get-CsAdminRole | ? {$_.Cmdlets –match \"Invoke-CsArchivingDatabasePurge\"}"]
[null,"Invoke-CsBackupServiceSync",{"$f":"IF(ISTEXT(A234),(HYPERLINK(SUBSTITUTE(HLINK(A234),\".aspx\",\"\")&IF(C$1=2013,\"(v=ocs.15).aspx\",\"(v=ocs.14).aspx\"),A234)),\"\")","v":""},{"$f":"IF(ISTEXT(B234),(HYPERLINK(SUBSTITUTE(HLINK(B234),\".aspx\",\"\")&IF(D$1=2013,\"(v=ocs.15).aspx\",\"(v=ocs.14).aspx\"),B234)),\"\")","v":"Invoke-CsBackupServiceSync"},"Manually invokes backup synchronization between a Lync Server 2013 pool and its designated backup pool. This allows administrators to synchronize data without waiting for Lync Server replication. This cmdlet was introduced in Lync Server 2013.","yes","no","no","no","no","no","yes","no","no","no","Get-CsAdminRole | ? {$_.Cmdlets –match \"Invoke-CsBackupServiceSync\"}"]
[null,"Invoke-CsCdrDatabasePurge",{"$f":"IF(ISTEXT(A235),(HYPERLINK(SUBSTITUTE(HLINK(A235),\".aspx\",\"\")&IF(C$1=2013,\"(v=ocs.15).aspx\",\"(v=ocs.14).aspx\"),A235)),\"\")","v":""},{"$f":"IF(ISTEXT(B235),(HYPERLINK(SUBSTITUTE(HLINK(B235),\".aspx\",\"\")&IF(D$1=2013,\"(v=ocs.15).aspx\",\"(v=ocs.14).aspx\"),B235)),\"\")","v":"Invoke-CsCdrDatabasePurge"},"Manually purges records from the Call Detail records (CDR) database. This cmdlet was introduced in Lync Server 2013.","yes","no","no","no","no","no","yes","no","no","no","Get-CsAdminRole | ? {$_.Cmdlets –match \"Invoke-CsCdrDatabasePurge\"}"]
[null,"Invoke-CsDatabaseFailover",{"$f":"IF(ISTEXT(A236),(HYPERLINK(SUBSTITUTE(HLINK(A236),\".aspx\",\"\")&IF(C$1=2013,\"(v=ocs.15).aspx\",\"(v=ocs.14).aspx\"),A236)),\"\")","v":""},{"$f":"IF(ISTEXT(B236),(HYPERLINK(SUBSTITUTE(HLINK(B236),\".aspx\",\"\")&IF(D$1=2013,\"(v=ocs.15).aspx\",\"(v=ocs.14).aspx\"),B236)),\"\")","v":"Invoke-CsDatabaseFailover"},"Invokes the process in which a Lync Server 2013 database fails over to its mirror database. After failover has been completed, the mirror database will become the principal database and will handle all new database requests. This cmdlet was introduced in Lync Server 2013.","yes","no","no","no","no","no","yes","no","no","no","Get-CsAdminRole | ? {$_.Cmdlets –match \"Invoke-CsDatabaseFailover\"}"]
[null,"Invoke-CsManagementServerFailover",{"$f":"IF(ISTEXT(A237),(HYPERLINK(SUBSTITUTE(HLINK(A237),\".aspx\",\"\")&IF(C$1=2013,\"(v=ocs.15).aspx\",\"(v=ocs.14).aspx\"),A237)),\"\")","v":""},{"$f":"IF(ISTEXT(B237),(HYPERLINK(SUBSTITUTE(HLINK(B237),\".aspx\",\"\")&IF(D$1=2013,\"(v=ocs.15).aspx\",\"(v=ocs.14).aspx\"),B237)),\"\")","v":"Invoke-CsManagementServerFailover"},"Invokes the process by which the Lync Server 2013 Central Management store is failed over. When the Central Management store is failed over the primary database will be replaced by either a pre-assigned mirror database or a specified backup database. This cmdlet was introduced in Lync Server 2013.","no","no","no","no","no","no","no","no","no","no","Get-CsAdminRole | ? {$_.Cmdlets –match \"Invoke-CsManagementServerFailover\"}"]
["Invoke-CsManagementStoreReplication","Invoke-CsManagementStoreReplication",{"$f":"IF(ISTEXT(A238),(HYPERLINK(SUBSTITUTE(HLINK(A238),\".aspx\",\"\")&IF(C$1=2013,\"(v=ocs.15).aspx\",\"(v=ocs.14).aspx\"),A238)),\"\")","v":"Invoke-CsManagementStoreReplication"},{"$f":"IF(ISTEXT(B238),(HYPERLINK(SUBSTITUTE(HLINK(B238),\".aspx\",\"\")&IF(D$1=2013,\"(v=ocs.15).aspx\",\"(v=ocs.14).aspx\"),B238)),\"\")","v":"Invoke-CsManagementStoreReplication"},"Forces Microsoft Lync Server 2010 replication services to send complete configuration data to the specified computers. This is done by deleting the replication status of the computers from the Central Management store.","yes","no","no","no","no","no","yes","no","no","no","Get-CsAdminRole | ? {$_.Cmdlets –match \"Invoke-CsManagementStoreReplication\"}"]
[null,"Invoke-CsPoolFailBack",{"$f":"IF(ISTEXT(A239),(HYPERLINK(SUBSTITUTE(HLINK(A239),\".aspx\",\"\")&IF(C$1=2013,\"(v=ocs.15).aspx\",\"(v=ocs.14).aspx\"),A239)),\"\")","v":""},{"$f":"IF(ISTEXT(B239),(HYPERLINK(SUBSTITUTE(HLINK(B239),\".aspx\",\"\")&IF(D$1=2013,\"(v=ocs.15).aspx\",\"(v=ocs.14).aspx\"),B239)),\"\")","v":"Invoke-CsPoolFailBack"},"Invokes the failback process for a Lync Server 2013 pool. Failback is used after a pool has failed over and the users of that pool have been \"failed over\" to a backup pool. (That simply means users who were signed on to the failed pool are automatically signed on to the backup pool.) When the failed pool has been restored, the fail back process signs the failed-over users back to their original pool. This cmdlet was introduced in Lync Server 2013.","no","no","no","no","no","no","no","no","no","no","Get-CsAdminRole | ? {$_.Cmdlets –match \"Invoke-CsPoolFailBack\"}"]
[null,"Invoke-CsPoolFailOver",{"$f":"IF(ISTEXT(A240),(HYPERLINK(SUBSTITUTE(HLINK(A240),\".aspx\",\"\")&IF(C$1=2013,\"(v=ocs.15).aspx\",\"(v=ocs.14).aspx\"),A240)),\"\")","v":""},{"$f":"IF(ISTEXT(B240),(HYPERLINK(SUBSTITUTE(HLINK(B240),\".aspx\",\"\")&IF(D$1=2013,\"(v=ocs.15).aspx\",\"(v=ocs.14).aspx\"),B240)),\"\")","v":"Invoke-CsPoolFailOver"},"Invokes the failover process for a Lync Server 2013 pool. Failover refers to the process that occurs when a pool fails and the current users of that pool are then signed on to a backup pool. This cmdlet was introduced in Lync Server 2013.","no","no","no","no","no","no","no","no","no","no","Get-CsAdminRole | ? {$_.Cmdlets –match \"Invoke-CsPoolFailOver\"}"]
[null,"Invoke-CsQoEDatabasePurge",{"$f":"IF(ISTEXT(A241),(HYPERLINK(SUBSTITUTE(HLINK(A241),\".aspx\",\"\")&IF(C$1=2013,\"(v=ocs.15).aspx\",\"(v=ocs.14).aspx\"),A241)),\"\")","v":""},{"$f":"IF(ISTEXT(B241),(HYPERLINK(SUBSTITUTE(HLINK(B241),\".aspx\",\"\")&IF(D$1=2013,\"(v=ocs.15).aspx\",\"(v=ocs.14).aspx\"),B241)),\"\")","v":"Invoke-CsQoEDatabasePurge"},"Manually purges records from the Quality of Experience (QoE) database. This cmdlet was introduced in Lync Server 2013.","yes","no","no","no","no","no","yes","no","no","no","Get-CsAdminRole | ? {$_.Cmdlets –match \"Invoke-CsQoEDatabasePurge\"}"]
[null,"Invoke-CsStorageServiceFlush",{"$f":"IF(ISTEXT(A242),(HYPERLINK(SUBSTITUTE(HLINK(A242),\".aspx\",\"\")&IF(C$1=2013,\"(v=ocs.15).aspx\",\"(v=ocs.14).aspx\"),A242)),\"\")","v":""},{"$f":"IF(ISTEXT(B242),(HYPERLINK(SUBSTITUTE(HLINK(B242),\".aspx\",\"\")&IF(D$1=2013,\"(v=ocs.15).aspx\",\"(v=ocs.14).aspx\"),B242)),\"\")","v":"Invoke-CsStorageServiceFlush"},"Flushes the Lync Server Storage Service database on each Front End server in a pool. Flushing a database involves writing all the queued data to disk, and then clearing the database queue. This cmdlet was introduced in Lync Server 2013.","yes","no","no","no","no","no","yes","no","no","no","Get-CsAdminRole | ? {$_.Cmdlets –match \"Invoke-CsStorageServiceFlush\"}"]
[null,"Invoke-CsUcsRollback",{"$f":"IF(ISTEXT(A243),(HYPERLINK(SUBSTITUTE(HLINK(A243),\".aspx\",\"\")&IF(C$1=2013,\"(v=ocs.15).aspx\",\"(v=ocs.14).aspx\"),A243)),\"\")","v":""},{"$f":"IF(ISTEXT(B243),(HYPERLINK(SUBSTITUTE(HLINK(B243),\".aspx\",\"\")&IF(D$1=2013,\"(v=ocs.15).aspx\",\"(v=ocs.14).aspx\"),B243)),\"\")","v":"Invoke-CsUcsRollback"},"Removes a user's contacts from the Unified Contact Store and, instead, stores that contact information in Lync Server 2013. The Unified Contact Store provides a way for users to maintain a single set of contacts that can be accessed using Lync 2013, Microsoft Outlook, and/or Microsoft Outlook Web Access. This cmdlet was introduced in Lync Server 2013.","yes","no","no","no","no","no","yes","yes","no","no",{"$f":"\"Get-CsAdminRole | ? {$_.Cmdlets –match \"& CHAR(34) &B243& CHAR(34) &\"}\"","v":"Get-CsAdminRole | ? {$_.Cmdlets –match \"Invoke-CsUcsRollback\"}"}]
["Lock-CsClientPin","Lock-CsClientPin",{"$f":"IF(ISTEXT(A244),(HYPERLINK(SUBSTITUTE(HLINK(A244),\".aspx\",\"\")&IF(C$1=2013,\"(v=ocs.15).aspx\",\"(v=ocs.14).aspx\"),A244)),\"\")","v":"Lock-CsClientPin"},{"$f":"IF(ISTEXT(B244),(HYPERLINK(SUBSTITUTE(HLINK(B244),\".aspx\",\"\")&IF(D$1=2013,\"(v=ocs.15).aspx\",\"(v=ocs.14).aspx\"),B244)),\"\")","v":"Lock-CsClientPin"},"Enables an administrator to prevent a user from using personal identification number (PIN) authentication.","yes","no","yes","no","no","no","no","yes","no","yes",{"$f":"\"Get-CsAdminRole | ? {$_.Cmdlets –match \"& CHAR(34) &B244& CHAR(34) &\"}\"","v":"Get-CsAdminRole | ? {$_.Cmdlets –match \"Lock-CsClientPin\"}"}]
["Merge-CsLegacyTopology","Merge-CsLegacyTopology",{"$f":"IF(ISTEXT(A245),(HYPERLINK(SUBSTITUTE(HLINK(A245),\".aspx\",\"\")&IF(C$1=2013,\"(v=ocs.15).aspx\",\"(v=ocs.14).aspx\"),A245)),\"\")","v":"Merge-CsLegacyTopology"},{"$f":"IF(ISTEXT(B245),(HYPERLINK(SUBSTITUTE(HLINK(B245),\".aspx\",\"\")&IF(D$1=2013,\"(v=ocs.15).aspx\",\"(v=ocs.14).aspx\"),B245)),\"\")","v":"Merge-CsLegacyTopology"},"Merge-CsLegacyTopology enables you to migrate topology information from Microsoft Office Communications Server 2007 R2 or Microsoft Office Communications Server 2007 to Microsoft Lync Server 2010. This helps provide interoperability between Lync Server 2010 and earlier versions of the software.","no","no","no","no","no","no","no","no","no","no",{"$f":"\"Get-CsAdminRole | ? {$_.Cmdlets –match \"& CHAR(34) &B245& CHAR(34) &\"}\"","v":"Get-CsAdminRole | ? {$_.Cmdlets –match \"Merge-CsLegacyTopology\"}"}]
["Move-CsAnalogDevice","Move-CsAnalogDevice",{"$f":"IF(ISTEXT(A246),(HYPERLINK(SUBSTITUTE(HLINK(A246),\".aspx\",\"\")&IF(C$1=2013,\"(v=ocs.15).aspx\",\"(v=ocs.14).aspx\"),A246)),\"\")","v":"Move-CsAnalogDevice"},{"$f":"IF(ISTEXT(B246),(HYPERLINK(SUBSTITUTE(HLINK(B246),\".aspx\",\"\")&IF(D$1=2013,\"(v=ocs.15).aspx\",\"(v=ocs.14).aspx\"),B246)),\"\")","v":"Move-CsAnalogDevice"},"Moves one or more analog devices to a new Registrar pool. An analog device is a telephone or other device that is connected to the public switched telephone network (PSTN).","yes","no","no","no","no","no","yes","yes","no","yes",{"$f":"\"Get-CsAdminRole | ? {$_.Cmdlets –match \"& CHAR(34) &B246& CHAR(34) &\"}\"","v":"Get-CsAdminRole | ? {$_.Cmdlets –match \"Move-CsAnalogDevice\"}"}]
["Move-CsApplicationEndpoint","Move-CsApplicationEndpoint",{"$f":"IF(ISTEXT(A247),(HYPERLINK(SUBSTITUTE(HLINK(A247),\".aspx\",\"\")&IF(C$1=2013,\"(v=ocs.15).aspx\",\"(v=ocs.14).aspx\"),A247)),\"\")","v":"Move-CsApplicationEndpoint"},{"$f":"IF(ISTEXT(B247),(HYPERLINK(SUBSTITUTE(HLINK(B247),\".aspx\",\"\")&IF(D$1=2013,\"(v=ocs.15).aspx\",\"(v=ocs.14).aspx\"),B247)),\"\")","v":"Move-CsApplicationEndpoint"},"Moves an endpoint to a different Registrar pool.","yes","no","no","no","no","no","yes","no","no","yes",{"$f":"\"Get-CsAdminRole | ? {$_.Cmdlets –match \"& CHAR(34) &B247& CHAR(34) &\"}\"","v":"Get-CsAdminRole | ? {$_.Cmdlets –match \"Move-CsApplicationEndpoint\"}"}]
["Move-CsCommonAreaPhone","Move-CsCommonAreaPhone",{"$f":"IF(ISTEXT(A248),(HYPERLINK(SUBSTITUTE(HLINK(A248),\".aspx\",\"\")&IF(C$1=2013,\"(v=ocs.15).aspx\",\"(v=ocs.14).aspx\"),A248)),\"\")","v":"Move-CsCommonAreaPhone"},{"$f":"IF(ISTEXT(B248),(HYPERLINK(SUBSTITUTE(HLINK(B248),\".aspx\",\"\")&IF(D$1=2013,\"(v=ocs.15).aspx\",\"(v=ocs.14).aspx\"),B248)),\"\")","v":"Move-CsCommonAreaPhone"},"Moves one or more common area phones to a new Registrar pool.","yes","no","no","no","no","no","yes","yes","no","yes",{"$f":"\"Get-CsAdminRole | ? {$_.Cmdlets –match \"& CHAR(34) &B248& CHAR(34) &\"}\"","v":"Get-CsAdminRole | ? {$_.Cmdlets –match \"Move-CsCommonAreaPhone\"}"}]
["Move-CsConferenceDirectory","Move-CsConferenceDirectory",{"$f":"IF(ISTEXT(A249),(HYPERLINK(SUBSTITUTE(HLINK(A249),\".aspx\",\"\")&IF(C$1=2013,\"(v=ocs.15).aspx\",\"(v=ocs.14).aspx\"),A249)),\"\")","v":"Move-CsConferenceDirectory"},{"$f":"IF(ISTEXT(B249),(HYPERLINK(SUBSTITUTE(HLINK(B249),\".aspx\",\"\")&IF(D$1=2013,\"(v=ocs.15).aspx\",\"(v=ocs.14).aspx\"),B249)),\"\")","v":"Move-CsConferenceDirectory"},"Moves an existing conference directory from one pool to another. Conference directories are used to help dial-in conferencing users locate conference information.","yes","no","no","no","no","no","yes","no","no","yes",{"$f":"\"Get-CsAdminRole | ? {$_.Cmdlets –match \"& CHAR(34) &B249& CHAR(34) &\"}\"","v":"Get-CsAdminRole | ? {$_.Cmdlets –match \"Move-CsConferenceDirectory\"}"}]
["Move-CsExUmContact","Move-CsExUmContact",{"$f":"IF(ISTEXT(A250),(HYPERLINK(SUBSTITUTE(HLINK(A250),\".aspx\",\"\")&IF(C$1=2013,\"(v=ocs.15).aspx\",\"(v=ocs.14).aspx\"),A250)),\"\")","v":"Move-CsExUmContact"},{"$f":"IF(ISTEXT(B250),(HYPERLINK(SUBSTITUTE(HLINK(B250),\".aspx\",\"\")&IF(D$1=2013,\"(v=ocs.15).aspx\",\"(v=ocs.14).aspx\"),B250)),\"\")","v":"Move-CsExUmContact"},"Moves one or more Exchange Unified Messaging (UM) contacts to a new Registrar pool.","yes","no","no","no","no","no","yes","yes","no","yes",{"$f":"\"Get-CsAdminRole | ? {$_.Cmdlets –match \"& CHAR(34) &B250& CHAR(34) &\"}\"","v":"Get-CsAdminRole | ? {$_.Cmdlets –match \"Move-CsExUmContact\"}"}]
["Move-CsLegacyUser","Move-CsLegacyUser",{"$f":"IF(ISTEXT(A251),(HYPERLINK(SUBSTITUTE(HLINK(A251),\".aspx\",\"\")&IF(C$1=2013,\"(v=ocs.15).aspx\",\"(v=ocs.14).aspx\"),A251)),\"\")","v":"Move-CsLegacyUser"},{"$f":"IF(ISTEXT(B251),(HYPERLINK(SUBSTITUTE(HLINK(B251),\".aspx\",\"\")&IF(D$1=2013,\"(v=ocs.15).aspx\",\"(v=ocs.14).aspx\"),B251)),\"\")","v":"Move-CsLegacyUser"},"Migrates one or more user accounts from Microsoft Office Communications Server 2007 R2 or Microsoft Office Communications Server 2007 to Microsoft Lync Server 2010.","yes","no","no","no","no","no","no","yes","no","no",{"$f":"\"Get-CsAdminRole | ? {$_.Cmdlets –match \"& CHAR(34) &B251& CHAR(34) &\"}\"","v":"Get-CsAdminRole | ? {$_.Cmdlets –match \"Move-CsLegacyUser\"}"}]
["Move-CsManagementServer","Move-CsManagementServer",{"$f":"IF(ISTEXT(A252),(HYPERLINK(SUBSTITUTE(HLINK(A252),\".aspx\",\"\")&IF(C$1=2013,\"(v=ocs.15).aspx\",\"(v=ocs.14).aspx\"),A252)),\"\")","v":"Move-CsManagementServer"},{"$f":"IF(ISTEXT(B252),(HYPERLINK(SUBSTITUTE(HLINK(B252),\".aspx\",\"\")&IF(D$1=2013,\"(v=ocs.15).aspx\",\"(v=ocs.14).aspx\"),B252)),\"\")","v":"Move-CsManagementServer"},"Moves the Central Management Server from one pool to another.","no","no","no","no","no","no","no","no","no","no",{"$f":"\"Get-CsAdminRole | ? {$_.Cmdlets –match \"& CHAR(34) &B252& CHAR(34) &\"}\"","v":"Get-CsAdminRole | ? {$_.Cmdlets –match \"Move-CsManagementServer\"}"}]
[null,"Move-CsMeetingRoom",{"$f":"IF(ISTEXT(A253),(HYPERLINK(SUBSTITUTE(HLINK(A253),\".aspx\",\"\")&IF(C$1=2013,\"(v=ocs.15).aspx\",\"(v=ocs.14).aspx\"),A253)),\"\")","v":""},{"$f":"IF(ISTEXT(B253),(HYPERLINK(SUBSTITUTE(HLINK(B253),\".aspx\",\"\")&IF(D$1=2013,\"(v=ocs.15).aspx\",\"(v=ocs.14).aspx\"),B253)),\"\")","v":"Move-CsMeetingRoom"},"Moves a Lync Server 2013 meeting room object from one Registrar pool to another. A meeting room is a conferencing device designed to address video conferencing and collaboration scenarios in small conference rooms. This cmdlet was introduced in Lync Server 2013.","yes","no","no","no","no","no","no","yes","no","no",{"$f":"\"Get-CsAdminRole | ? {$_.Cmdlets –match \"& CHAR(34) &B253& CHAR(34) &\"}\"","v":"Get-CsAdminRole | ? {$_.Cmdlets –match \"Move-CsMeetingRoom\"}"}]
["Move-CsRgsConfiguration","Move-CsRgsConfiguration",{"$f":"IF(ISTEXT(A254),(HYPERLINK(SUBSTITUTE(HLINK(A254),\".aspx\",\"\")&IF(C$1=2013,\"(v=ocs.15).aspx\",\"(v=ocs.14).aspx\"),A254)),\"\")","v":"Move-CsRgsConfiguration"},{"$f":"IF(ISTEXT(B254),(HYPERLINK(SUBSTITUTE(HLINK(B254),\".aspx\",\"\")&IF(D$1=2013,\"(v=ocs.15).aspx\",\"(v=ocs.14).aspx\"),B254)),\"\")","v":"Move-CsRgsConfiguration"},"Enables you to migrate Response Group configuration settings from Microsoft Office Communications Server 2007 R2 to Microsoft Lync Server 2010.","yes","no","no","no","no","yes","yes","no","no","yes",{"$f":"\"Get-CsAdminRole | ? {$_.Cmdlets –match \"& CHAR(34) &B254& CHAR(34) &\"}\"","v":"Get-CsAdminRole | ? {$_.Cmdlets –match \"Move-CsRgsConfiguration\"}"}]
["Move-CsUser","Move-CsUser",{"$f":"IF(ISTEXT(A255),(HYPERLINK(SUBSTITUTE(HLINK(A255),\".aspx\",\"\")&IF(C$1=2013,\"(v=ocs.15).aspx\",\"(v=ocs.14).aspx\"),A255)),\"\")","v":"Move-CsUser"},{"$f":"IF(ISTEXT(B255),(HYPERLINK(SUBSTITUTE(HLINK(B255),\".aspx\",\"\")&IF(D$1=2013,\"(v=ocs.15).aspx\",\"(v=ocs.14).aspx\"),B255)),\"\")","v":"Move-CsUser"},"Moves one or more user accounts enabled for Microsoft Lync Server 2010 to a new Registrar pool.","yes","no","no","no","no","no","yes","yes","no","no",{"$f":"\"Get-CsAdminRole | ? {$_.Cmdlets –match \"& CHAR(34) &B255& CHAR(34) &\"}\"","v":"Get-CsAdminRole | ? {$_.Cmdlets –match \"Move-CsUser\"}"}]
["New-CsAddressBookConfiguration","New-CsAddressBookConfiguration",{"$f":"IF(ISTEXT(A256),(HYPERLINK(SUBSTITUTE(HLINK(A256),\".aspx\",\"\")&IF(C$1=2013,\"(v=ocs.15).aspx\",\"(v=ocs.14).aspx\"),A256)),\"\")","v":"New-CsAddressBookConfiguration"},{"$f":"IF(ISTEXT(B256),(HYPERLINK(SUBSTITUTE(HLINK(B256),\".aspx\",\"\")&IF(D$1=2013,\"(v=ocs.15).aspx\",\"(v=ocs.14).aspx\"),B256)),\"\")","v":"New-CsAddressBookConfiguration"},"Creates a new collection of Address Book configuration settings.","yes","no","no","no","no","no","yes","no","no","no",{"$f":"\"Get-CsAdminRole | ? {$_.Cmdlets –match \"& CHAR(34) &B256& CHAR(34) &\"}\"","v":"Get-CsAdminRole | ? {$_.Cmdlets –match \"New-CsAddressBookConfiguration\"}"}]
["New-CsAdminRole","New-CsAdminRole",{"$f":"IF(ISTEXT(A257),(HYPERLINK(SUBSTITUTE(HLINK(A257),\".aspx\",\"\")&IF(C$1=2013,\"(v=ocs.15).aspx\",\"(v=ocs.14).aspx\"),A257)),\"\")","v":"New-CsAdminRole"},{"$f":"IF(ISTEXT(B257),(HYPERLINK(SUBSTITUTE(HLINK(B257),\".aspx\",\"\")&IF(D$1=2013,\"(v=ocs.15).aspx\",\"(v=ocs.14).aspx\"),B257)),\"\")","v":"New-CsAdminRole"},"Creates a new role-based access control (RBAC) role. RBAC roles are used to define the management tasks that users are allowed to carry out, and to determine the scope in which users will be allowed to perform these tasks.","yes","no","no","no","no","no","no","no","no","no",{"$f":"\"Get-CsAdminRole | ? {$_.Cmdlets –match \"& CHAR(34) &B257& CHAR(34) &\"}\"","v":"Get-CsAdminRole | ? {$_.Cmdlets –match \"New-CsAdminRole\"}"}]
["New-CsAllowedDomain","New-CsAllowedDomain",{"$f":"IF(ISTEXT(A258),(HYPERLINK(SUBSTITUTE(HLINK(A258),\".aspx\",\"\")&IF(C$1=2013,\"(v=ocs.15).aspx\",\"(v=ocs.14).aspx\"),A258)),\"\")","v":"New-CsAllowedDomain"},{"$f":"IF(ISTEXT(B258),(HYPERLINK(SUBSTITUTE(HLINK(B258),\".aspx\",\"\")&IF(D$1=2013,\"(v=ocs.15).aspx\",\"(v=ocs.14).aspx\"),B258)),\"\")","v":"New-CsAllowedDomain"},"Adds a domain to the list of domains approved for federation. After a domain has been approved for federation (by being added to the allowed list), your users can exchange instant messages and presence information with people who have accounts in the federated domain.","yes","no","no","no","no","no","yes","no","no","no",{"$f":"\"Get-CsAdminRole | ? {$_.Cmdlets –match \"& CHAR(34) &B258& CHAR(34) &\"}\"","v":"Get-CsAdminRole | ? {$_.Cmdlets –match \"New-CsAllowedDomain\"}"}]
["New-CsAnalogDevice","New-CsAnalogDevice",{"$f":"IF(ISTEXT(A259),(HYPERLINK(SUBSTITUTE(HLINK(A259),\".aspx\",\"\")&IF(C$1=2013,\"(v=ocs.15).aspx\",\"(v=ocs.14).aspx\"),A259)),\"\")","v":"New-CsAnalogDevice"},{"$f":"IF(ISTEXT(B259),(HYPERLINK(SUBSTITUTE(HLINK(B259),\".aspx\",\"\")&IF(D$1=2013,\"(v=ocs.15).aspx\",\"(v=ocs.14).aspx\"),B259)),\"\")","v":"New-CsAnalogDevice"},"Creates a new analog device that can be managed by using Microsoft Lync Server 2010. An analog device is a telephone or other device that is connected to the public switched telephone network (PSTN).","yes","no","no","no","no","no","yes","yes","no","yes",{"$f":"\"Get-CsAdminRole | ? {$_.Cmdlets –match \"& CHAR(34) &B259& CHAR(34) &\"}\"","v":"Get-CsAdminRole | ? {$_.Cmdlets –match \"New-CsAnalogDevice\"}"}]
["New-CsAnnouncement","New-CsAnnouncement",{"$f":"IF(ISTEXT(A260),(HYPERLINK(SUBSTITUTE(HLINK(A260),\".aspx\",\"\")&IF(C$1=2013,\"(v=ocs.15).aspx\",\"(v=ocs.14).aspx\"),A260)),\"\")","v":"New-CsAnnouncement"},{"$f":"IF(ISTEXT(B260),(HYPERLINK(SUBSTITUTE(HLINK(B260),\".aspx\",\"\")&IF(D$1=2013,\"(v=ocs.15).aspx\",\"(v=ocs.14).aspx\"),B260)),\"\")","v":"New-CsAnnouncement"},"Creates a new Microsoft Lync Server 2010 announcement. Announcements are played when users dial a valid but unassigned phone number. An announcement can be a message (such as \"This number is temporarily out of service\") or a busy signal.","yes","no","no","no","no","no","yes","no","no","yes",{"$f":"\"Get-CsAdminRole | ? {$_.Cmdlets –match \"& CHAR(34) &B260& CHAR(34) &\"}\"","v":"Get-CsAdminRole | ? {$_.Cmdlets –match \"New-CsAnnouncement\"}"}]
["New-CsArchivingConfiguration","New-CsArchivingConfiguration",{"$f":"IF(ISTEXT(A261),(HYPERLINK(SUBSTITUTE(HLINK(A261),\".aspx\",\"\")&IF(C$1=2013,\"(v=ocs.15).aspx\",\"(v=ocs.14).aspx\"),A261)),\"\")","v":"New-CsArchivingConfiguration"},{"$f":"IF(ISTEXT(B261),(HYPERLINK(SUBSTITUTE(HLINK(B261),\".aspx\",\"\")&IF(D$1=2013,\"(v=ocs.15).aspx\",\"(v=ocs.14).aspx\"),B261)),\"\")","v":"New-CsArchivingConfiguration"},"Creates a new set of instant messaging (IM) archiving settings. These settings can be used to enable or disable the automatic saving of IM sessions; these settings also enable you to block any instant messages that cannot be archived.","yes","yes","no","no","no","no","no","no","no","no",{"$f":"\"Get-CsAdminRole | ? {$_.Cmdlets –match \"& CHAR(34) &B261& CHAR(34) &\"}\"","v":"Get-CsAdminRole | ? {$_.Cmdlets –match \"New-CsArchivingConfiguration\"}"}]
["New-CsArchivingPolicy","New-CsArchivingPolicy",{"$f":"IF(ISTEXT(A262),(HYPERLINK(SUBSTITUTE(HLINK(A262),\".aspx\",\"\")&IF(C$1=2013,\"(v=ocs.15).aspx\",\"(v=ocs.14).aspx\"),A262)),\"\")","v":"New-CsArchivingPolicy"},{"$f":"IF(ISTEXT(B262),(HYPERLINK(SUBSTITUTE(HLINK(B262),\".aspx\",\"\")&IF(D$1=2013,\"(v=ocs.15).aspx\",\"(v=ocs.14).aspx\"),B262)),\"\")","v":"New-CsArchivingPolicy"},"Creates new instant messaging (IM) session archiving policies. These policies give you the ability to archive all IM sessions that take place between internal users, and/or to archive all IM sessions that take place between internal users and external partners.","yes","yes","no","no","no","no","no","no","no","no",{"$f":"\"Get-CsAdminRole | ? {$_.Cmdlets –match \"& CHAR(34) &B262& CHAR(34) &\"}\"","v":"Get-CsAdminRole | ? {$_.Cmdlets –match \"New-CsArchivingPolicy\"}"}]
["New-CsAutoDiscoverConfiguration","New-CsAutodiscoverConfiguration",{"$f":"IF(ISTEXT(A263),(HYPERLINK(SUBSTITUTE(HLINK(A263),\".aspx\",\"\")&IF(C$1=2013,\"(v=ocs.15).aspx\",\"(v=ocs.14).aspx\"),A263)),\"\")","v":"New-CsAutoDiscoverConfiguration"},{"$f":"IF(ISTEXT(B263),(HYPERLINK(SUBSTITUTE(HLINK(B263),\".aspx\",\"\")&IF(D$1=2013,\"(v=ocs.15).aspx\",\"(v=ocs.14).aspx\"),B263)),\"\")","v":"New-CsAutodiscoverConfiguration"},"Creates a new collection of Autodiscover configuration settings at the site scope. The Autodiscover service provides a way for client applications such as Lync Web App or Microsoft Lync Mobile to locate key resources such as a user's home pool or the URL for joining a dial-in conference. This cmdlet was introduced in the cumulative update for Lync Server 2010: November 2011.","yes","no","no","no","no","no","yes","no","no","no",{"$f":"\"Get-CsAdminRole | ? {$_.Cmdlets –match \"& CHAR(34) &B263& CHAR(34) &\"}\"","v":"Get-CsAdminRole | ? {$_.Cmdlets –match \"New-CsAutodiscoverConfiguration\"}"}]
["New-CsAVEdgeConfiguration","New-CsAVEdgeConfiguration",{"$f":"IF(ISTEXT(A264),(HYPERLINK(SUBSTITUTE(HLINK(A264),\".aspx\",\"\")&IF(C$1=2013,\"(v=ocs.15).aspx\",\"(v=ocs.14).aspx\"),A264)),\"\")","v":"New-CsAVEdgeConfiguration"},{"$f":"IF(ISTEXT(B264),(HYPERLINK(SUBSTITUTE(HLINK(B264),\".aspx\",\"\")&IF(D$1=2013,\"(v=ocs.15).aspx\",\"(v=ocs.14).aspx\"),B264)),\"\")","v":"New-CsAVEdgeConfiguration"},"Creates a new collection of configuration settings for computers running the A/V Edge service (these computers are also known as A/V Edge servers). An A/V Edge server enables internal users to share audio and video data with external users (that is, users who are not logged on to your internal network).","yes","no","no","no","no","no","yes","no","no","no",{"$f":"\"Get-CsAdminRole | ? {$_.Cmdlets –match \"& CHAR(34) &B264& CHAR(34) &\"}\"","v":"Get-CsAdminRole | ? {$_.Cmdlets –match \"New-CsAVEdgeConfiguration\"}"}]
["New-CsBandwidthPolicyServiceConfiguration","New-CsBandwidthPolicyServiceConfiguration",{"$f":"IF(ISTEXT(A265),(HYPERLINK(SUBSTITUTE(HLINK(A265),\".aspx\",\"\")&IF(C$1=2013,\"(v=ocs.15).aspx\",\"(v=ocs.14).aspx\"),A265)),\"\")","v":"New-CsBandwidthPolicyServiceConfiguration"},{"$f":"IF(ISTEXT(B265),(HYPERLINK(SUBSTITUTE(HLINK(B265),\".aspx\",\"\")&IF(D$1=2013,\"(v=ocs.15).aspx\",\"(v=ocs.14).aspx\"),B265)),\"\")","v":"New-CsBandwidthPolicyServiceConfiguration"},"Creates a new bandwidth policy service configuration.","yes","no","no","no","no","no","yes","no","no","yes",{"$f":"\"Get-CsAdminRole | ? {$_.Cmdlets –match \"& CHAR(34) &B265& CHAR(34) &\"}\"","v":"Get-CsAdminRole | ? {$_.Cmdlets –match \"New-CsBandwidthPolicyServiceConfiguration\"}"}]
["New-CsBlockedDomain","New-CsBlockedDomain",{"$f":"IF(ISTEXT(A266),(HYPERLINK(SUBSTITUTE(HLINK(A266),\".aspx\",\"\")&IF(C$1=2013,\"(v=ocs.15).aspx\",\"(v=ocs.14).aspx\"),A266)),\"\")","v":"New-CsBlockedDomain"},{"$f":"IF(ISTEXT(B266),(HYPERLINK(SUBSTITUTE(HLINK(B266),\".aspx\",\"\")&IF(D$1=2013,\"(v=ocs.15).aspx\",\"(v=ocs.14).aspx\"),B266)),\"\")","v":"New-CsBlockedDomain"},"Adds a new domain to the list of domains blocked for federation. By definition, your users are not allowed to use Microsoft Lync Server 2010 applications to communicate with people from the blocked domain; for example, users cannot use Microsoft Lync 2010 to exchange instant messages with anyone with a SIP account in a domain that appears on the blocked list.","yes","no","no","no","no","no","yes","no","no","no","Get-CsAdminRole | ? {$_.Cmdlets –match \"New-CsBlockedDomain\"}"]
["New-CsCallParkOrbit","New-CsCallParkOrbit",{"$f":"IF(ISTEXT(A267),(HYPERLINK(SUBSTITUTE(HLINK(A267),\".aspx\",\"\")&IF(C$1=2013,\"(v=ocs.15).aspx\",\"(v=ocs.14).aspx\"),A267)),\"\")","v":"New-CsCallParkOrbit"},{"$f":"IF(ISTEXT(B267),(HYPERLINK(SUBSTITUTE(HLINK(B267),\".aspx\",\"\")&IF(D$1=2013,\"(v=ocs.15).aspx\",\"(v=ocs.14).aspx\"),B267)),\"\")","v":"New-CsCallParkOrbit"},"Creates a new, named range of numbers assigned for parking calls within an organization.","yes","no","no","no","no","no","yes","no","no","yes","Get-CsAdminRole | ? {$_.Cmdlets –match \"New-CsCallParkOrbit\"}"]
["New-CsCdrConfiguration","New-CsCdrConfiguration",{"$f":"IF(ISTEXT(A268),(HYPERLINK(SUBSTITUTE(HLINK(A268),\".aspx\",\"\")&IF(C$1=2013,\"(v=ocs.15).aspx\",\"(v=ocs.14).aspx\"),A268)),\"\")","v":"New-CsCdrConfiguration"},{"$f":"IF(ISTEXT(B268),(HYPERLINK(SUBSTITUTE(HLINK(B268),\".aspx\",\"\")&IF(D$1=2013,\"(v=ocs.15).aspx\",\"(v=ocs.14).aspx\"),B268)),\"\")","v":"New-CsCdrConfiguration"},"Creates a new set of call detail recording (CDR) settings. CDR enables you to track usage of such things as peer-to-peer instant messaging sessions, Voice over Internet Protocol (VoIP) phone calls, and conferencing calls. This usage data includes information about who called whom, when they called, and how long they talked.","yes","no","no","no","no","no","yes","no","no","no","Get-CsAdminRole | ? {$_.Cmdlets –match \"New-CsCdrConfiguration\"}"]
["New-CsClientPolicy","New-CsClientPolicy",{"$f":"IF(ISTEXT(A269),(HYPERLINK(SUBSTITUTE(HLINK(A269),\".aspx\",\"\")&IF(C$1=2013,\"(v=ocs.15).aspx\",\"(v=ocs.14).aspx\"),A269)),\"\")","v":"New-CsClientPolicy"},{"$f":"IF(ISTEXT(B269),(HYPERLINK(SUBSTITUTE(HLINK(B269),\".aspx\",\"\")&IF(D$1=2013,\"(v=ocs.15).aspx\",\"(v=ocs.14).aspx\"),B269)),\"\")","v":"New-CsClientPolicy"},"Creates a new client policy. Among other things, client policies help determine the features of Microsoft Lync 2010 that are made available to users; for example, you might give some users the right to transfer files while denying this right to other users.","yes","no","no","no","no","no","yes","no","no","no","Get-CsAdminRole | ? {$_.Cmdlets –match \"New-CsClientPolicy\"}"]
["New-CsClientPolicyEntry","New-CsClientPolicyEntry",{"$f":"IF(ISTEXT(A270),(HYPERLINK(SUBSTITUTE(HLINK(A270),\".aspx\",\"\")&IF(C$1=2013,\"(v=ocs.15).aspx\",\"(v=ocs.14).aspx\"),A270)),\"\")","v":"New-CsClientPolicyEntry"},{"$f":"IF(ISTEXT(B270),(HYPERLINK(SUBSTITUTE(HLINK(B270),\".aspx\",\"\")&IF(D$1=2013,\"(v=ocs.15).aspx\",\"(v=ocs.14).aspx\"),B270)),\"\")","v":"New-CsClientPolicyEntry"},"Adds new options to Microsoft Lync Server 2010 client policies.","yes","no","no","no","no","no","yes","no","no","no","Get-CsAdminRole | ? {$_.Cmdlets –match \"New-CsClientPolicyEntry\"}"]
["New-CsClientVersionConfiguration","New-CsClientVersionConfiguration",{"$f":"IF(ISTEXT(A271),(HYPERLINK(SUBSTITUTE(HLINK(A271),\".aspx\",\"\")&IF(C$1=2013,\"(v=ocs.15).aspx\",\"(v=ocs.14).aspx\"),A271)),\"\")","v":"New-CsClientVersionConfiguration"},{"$f":"IF(ISTEXT(B271),(HYPERLINK(SUBSTITUTE(HLINK(B271),\".aspx\",\"\")&IF(D$1=2013,\"(v=ocs.15).aspx\",\"(v=ocs.14).aspx\"),B271)),\"\")","v":"New-CsClientVersionConfiguration"},"Creates a new collection of client version configuration settings. Client version configuration settings determine whether or not Microsoft Lync Server 2010 checks the version number of each client application that logs on to the system. If client version filtering is enabled, then the ability of that client application to access the system will be based on settings configured in the appropriate client version policy.","yes","no","no","no","no","no","yes","no","no","no","Get-CsAdminRole | ? {$_.Cmdlets –match \"New-CsClientVersionConfiguration\"}"]
["New-CsClientVersionPolicy","New-CsClientVersionPolicy",{"$f":"IF(ISTEXT(A272),(HYPERLINK(SUBSTITUTE(HLINK(A272),\".aspx\",\"\")&IF(C$1=2013,\"(v=ocs.15).aspx\",\"(v=ocs.14).aspx\"),A272)),\"\")","v":"New-CsClientVersionPolicy"},{"$f":"IF(ISTEXT(B272),(HYPERLINK(SUBSTITUTE(HLINK(B272),\".aspx\",\"\")&IF(D$1=2013,\"(v=ocs.15).aspx\",\"(v=ocs.14).aspx\"),B272)),\"\")","v":"New-CsClientVersionPolicy"},"Creates a new client version policy. Client version policies enable you to specify which versions of clients (such as Microsoft Office Communicator 2007 R2) will be able to log on to your Microsoft Lync Server 2010 system.","yes","no","no","no","no","no","yes","no","no","no","Get-CsAdminRole | ? {$_.Cmdlets –match \"New-CsClientVersionPolicy\"}"]
["New-CsClientVersionPolicyRule","New-CsClientVersionPolicyRule",{"$f":"IF(ISTEXT(A273),(HYPERLINK(SUBSTITUTE(HLINK(A273),\".aspx\",\"\")&IF(C$1=2013,\"(v=ocs.15).aspx\",\"(v=ocs.14).aspx\"),A273)),\"\")","v":"New-CsClientVersionPolicyRule"},{"$f":"IF(ISTEXT(B273),(HYPERLINK(SUBSTITUTE(HLINK(B273),\".aspx\",\"\")&IF(D$1=2013,\"(v=ocs.15).aspx\",\"(v=ocs.14).aspx\"),B273)),\"\")","v":"New-CsClientVersionPolicyRule"},"Creates a new client version policy rule. Client version policy rules help determine whether users can use a specific client application to log on to Microsoft Lync Server 2010.","yes","no","no","no","no","no","yes","no","no","no","Get-CsAdminRole | ? {$_.Cmdlets –match \"New-CsClientVersionPolicyRule\"}"]
[null,"New-CsClsRegion",{"$f":"IF(ISTEXT(A274),(HYPERLINK(SUBSTITUTE(HLINK(A274),\".aspx\",\"\")&IF(C$1=2013,\"(v=ocs.15).aspx\",\"(v=ocs.14).aspx\"),A274)),\"\")","v":""},{"$f":"IF(ISTEXT(B274),(HYPERLINK(SUBSTITUTE(HLINK(B274),\".aspx\",\"\")&IF(D$1=2013,\"(v=ocs.15).aspx\",\"(v=ocs.14).aspx\"),B274)),\"\")","v":"New-CsClsRegion"},"Creates a new centralized logging configuration region. Centralized logging provides a way for administrators to simultaneously enable or disable event tracing on multiple computers. Centralized logging regions are intended for use with Lync Online. This cmdlet was introduced in Lync Server 2013.","yes","no","no","no","no","no","yes","no","no","no","Get-CsAdminRole | ? {$_.Cmdlets –match \"New-CsClsRegion\"}"]
[null,"New-CsClsScenario",{"$f":"IF(ISTEXT(A275),(HYPERLINK(SUBSTITUTE(HLINK(A275),\".aspx\",\"\")&IF(C$1=2013,\"(v=ocs.15).aspx\",\"(v=ocs.14).aspx\"),A275)),\"\")","v":""},{"$f":"IF(ISTEXT(B275),(HYPERLINK(SUBSTITUTE(HLINK(B275),\".aspx\",\"\")&IF(D$1=2013,\"(v=ocs.15).aspx\",\"(v=ocs.14).aspx\"),B275)),\"\")","v":"New-CsClsScenario"},"Creates a new centralized logging configuration scenario. A scenario represents a particular Lync Server 2013 component or situation (such as IM and presence) that administrators can enable or disable for tracing. This cmdlet was introduced in Lync Server 2013.","yes","no","no","no","no","no","yes","no","no","no","Get-CsAdminRole | ? {$_.Cmdlets –match \"New-CsClsScenario\"}"]
[null,"New-CsClsSecurityGroup",{"$f":"IF(ISTEXT(A276),(HYPERLINK(SUBSTITUTE(HLINK(A276),\".aspx\",\"\")&IF(C$1=2013,\"(v=ocs.15).aspx\",\"(v=ocs.14).aspx\"),A276)),\"\")","v":""},{"$f":"IF(ISTEXT(B276),(HYPERLINK(SUBSTITUTE(HLINK(B276),\".aspx\",\"\")&IF(D$1=2013,\"(v=ocs.15).aspx\",\"(v=ocs.14).aspx\"),B276)),\"\")","v":"New-CsClsSecurityGroup"},"Creates a new centralized logging configuration security group. Centralized logging provides a way for administrators to simultaneously enable or disable event tracing on multiple computers. This cmdlet was introduced in Lync Server 2013.","yes","no","no","no","no","no","yes","no","no","no","Get-CsAdminRole | ? {$_.Cmdlets –match \"New-CsClsSecurityGroup\"}"]
["New-CsCommonAreaPhone","New-CsCommonAreaPhone",{"$f":"IF(ISTEXT(A277),(HYPERLINK(SUBSTITUTE(HLINK(A277),\".aspx\",\"\")&IF(C$1=2013,\"(v=ocs.15).aspx\",\"(v=ocs.14).aspx\"),A277)),\"\")","v":"New-CsCommonAreaPhone"},{"$f":"IF(ISTEXT(B277),(HYPERLINK(SUBSTITUTE(HLINK(B277),\".aspx\",\"\")&IF(D$1=2013,\"(v=ocs.15).aspx\",\"(v=ocs.14).aspx\"),B277)),\"\")","v":"New-CsCommonAreaPhone"},"Creates a new common area phone that can be managed by using Microsoft Lync Server 2010. Common area phones are phones that are located in building lobbies, employee lounges, or other areas where they are likely to be used by a number of different people and for a number of different uses.","yes","no","no","no","no","no","yes","yes","no","yes","Get-CsAdminRole | ? {$_.Cmdlets –match \"New-CsCommonAreaPhone\"}"]
["New-CsConferenceDirectory","New-CsConferenceDirectory",{"$f":"IF(ISTEXT(A278),(HYPERLINK(SUBSTITUTE(HLINK(A278),\".aspx\",\"\")&IF(C$1=2013,\"(v=ocs.15).aspx\",\"(v=ocs.14).aspx\"),A278)),\"\")","v":"New-CsConferenceDirectory"},{"$f":"IF(ISTEXT(B278),(HYPERLINK(SUBSTITUTE(HLINK(B278),\".aspx\",\"\")&IF(D$1=2013,\"(v=ocs.15).aspx\",\"(v=ocs.14).aspx\"),B278)),\"\")","v":"New-CsConferenceDirectory"},"Creates a new conference directory for use in your organization. Conference directories are used to help dial-in conferencing users locate conference information.","yes","no","no","no","no","no","yes","no","no","no","Get-CsAdminRole | ? {$_.Cmdlets –match \"New-CsConferenceDirectory\"}"]
["New-CsConferencingConfiguration","New-CsConferencingConfiguration",{"$f":"IF(ISTEXT(A279),(HYPERLINK(SUBSTITUTE(HLINK(A279),\".aspx\",\"\")&IF(C$1=2013,\"(v=ocs.15).aspx\",\"(v=ocs.14).aspx\"),A279)),\"\")","v":"New-CsConferencingConfiguration"},{"$f":"IF(ISTEXT(B279),(HYPERLINK(SUBSTITUTE(HLINK(B279),\".aspx\",\"\")&IF(D$1=2013,\"(v=ocs.15).aspx\",\"(v=ocs.14).aspx\"),B279)),\"\")","v":"New-CsConferencingConfiguration"},"Creates a new collection of conference configuration settings. Conference settings determine such things as the maximum-allowed size for conference content and handouts, the content grace period (that is, the amount of time content will be stored before being deleted), and the URLs for the internal and external downloads of the supported client.","yes","no","no","no","no","no","yes","no","no","no","Get-CsAdminRole | ? {$_.Cmdlets –match \"New-CsConferencingConfiguration\"}"]
["New-CsConferencingPolicy","New-CsConferencingPolicy",{"$f":"IF(ISTEXT(A280),(HYPERLINK(SUBSTITUTE(HLINK(A280),\".aspx\",\"\")&IF(C$1=2013,\"(v=ocs.15).aspx\",\"(v=ocs.14).aspx\"),A280)),\"\")","v":"New-CsConferencingPolicy"},{"$f":"IF(ISTEXT(B280),(HYPERLINK(SUBSTITUTE(HLINK(B280),\".aspx\",\"\")&IF(D$1=2013,\"(v=ocs.15).aspx\",\"(v=ocs.14).aspx\"),B280)),\"\")","v":"New-CsConferencingPolicy"},"Creates a new conferencing policy for use in your organization. Conferencing policies determine the features and capabilities that can be used in a conference; this includes everything from whether or not the conference can include IP audio and video to the maximum number of people who can attend a meeting.","yes","no","no","no","no","no","yes","no","no","no","Get-CsAdminRole | ? {$_.Cmdlets –match \"New-CsConferencingPolicy\"}"]
["New-CsCpsConfiguration","New-CsCpsConfiguration",{"$f":"IF(ISTEXT(A281),(HYPERLINK(SUBSTITUTE(HLINK(A281),\".aspx\",\"\")&IF(C$1=2013,\"(v=ocs.15).aspx\",\"(v=ocs.14).aspx\"),A281)),\"\")","v":"New-CsCpsConfiguration"},{"$f":"IF(ISTEXT(B281),(HYPERLINK(SUBSTITUTE(HLINK(B281),\".aspx\",\"\")&IF(D$1=2013,\"(v=ocs.15).aspx\",\"(v=ocs.14).aspx\"),B281)),\"\")","v":"New-CsCpsConfiguration"},"Creates a new collection of Call Park service settings. Call parking is a service that allows a user to \"park\" an incoming phone call. Parking a call transfers it to a number in a specified range, or orbit, and immediately places the call on hold. Anyone (not just the person who originally answered the call) can resume the conversation from any telephone by entering the correct number.","yes","no","no","no","no","no","yes","no","no","yes","Get-CsAdminRole | ? {$_.Cmdlets –match \"New-CsCpsConfiguration\"}"]
["New-CsDeviceUpdateConfiguration","New-CsDeviceUpdateConfiguration",{"$f":"IF(ISTEXT(A282),(HYPERLINK(SUBSTITUTE(HLINK(A282),\".aspx\",\"\")&IF(C$1=2013,\"(v=ocs.15).aspx\",\"(v=ocs.14).aspx\"),A282)),\"\")","v":"New-CsDeviceUpdateConfiguration"},{"$f":"IF(ISTEXT(B282),(HYPERLINK(SUBSTITUTE(HLINK(B282),\".aspx\",\"\")&IF(D$1=2013,\"(v=ocs.15).aspx\",\"(v=ocs.14).aspx\"),B282)),\"\")","v":"New-CsDeviceUpdateConfiguration"},"Creates a new instance of device update configuration settings. These settings are used to manage the Device Update Web service, a Microsoft Lync Server 2010 component that enables administrators to distribute firmware updates to telephones and other devices running Microsoft Lync 2010 Phone Edition.","yes","no","no","no","no","no","yes","no","no","yes","Get-CsAdminRole | ? {$_.Cmdlets –match \"New-CsDeviceUpdateConfiguration\"}"]
["New-CsDiagnosticConfiguration","New-CsDiagnosticConfiguration",{"$f":"IF(ISTEXT(A283),(HYPERLINK(SUBSTITUTE(HLINK(A283),\".aspx\",\"\")&IF(C$1=2013,\"(v=ocs.15).aspx\",\"(v=ocs.14).aspx\"),A283)),\"\")","v":"New-CsDiagnosticConfiguration"},{"$f":"IF(ISTEXT(B283),(HYPERLINK(SUBSTITUTE(HLINK(B283),\".aspx\",\"\")&IF(D$1=2013,\"(v=ocs.15).aspx\",\"(v=ocs.14).aspx\"),B283)),\"\")","v":"New-CsDiagnosticConfiguration"},"Creates new diagnostic configuration settings. Diagnostic configuration settings are used to determine whether traffic to or from a given domain or Uniform Resource Identifier (URI) is recorded in your Microsoft Lync Server 2010 log files.","yes","no","no","no","no","no","yes","no","no","no","Get-CsAdminRole | ? {$_.Cmdlets –match \"New-CsDiagnosticConfiguration\"}"]
["New-CsDiagnosticHeaderConfiguration","New-CsDiagnosticHeaderConfiguration",{"$f":"IF(ISTEXT(A284),(HYPERLINK(SUBSTITUTE(HLINK(A284),\".aspx\",\"\")&IF(C$1=2013,\"(v=ocs.15).aspx\",\"(v=ocs.14).aspx\"),A284)),\"\")","v":"New-CsDiagnosticHeaderConfiguration"},{"$f":"IF(ISTEXT(B284),(HYPERLINK(SUBSTITUTE(HLINK(B284),\".aspx\",\"\")&IF(D$1=2013,\"(v=ocs.15).aspx\",\"(v=ocs.14).aspx\"),B284)),\"\")","v":"New-CsDiagnosticHeaderConfiguration"},"Creates a new diagnostic header configuration setting collection. Diagnostic header configuration settings determine whether SIP messages are accompanied by header information that can be useful in troubleshooting and error reporting.","yes","no","no","no","no","no","yes","no","no","no","Get-CsAdminRole | ? {$_.Cmdlets –match \"New-CsDiagnosticHeaderConfiguration\"}"]
["New-CsDiagnosticsFilter","New-CsDiagnosticsFilter",{"$f":"IF(ISTEXT(A285),(HYPERLINK(SUBSTITUTE(HLINK(A285),\".aspx\",\"\")&IF(C$1=2013,\"(v=ocs.15).aspx\",\"(v=ocs.14).aspx\"),A285)),\"\")","v":"New-CsDiagnosticsFilter"},{"$f":"IF(ISTEXT(B285),(HYPERLINK(SUBSTITUTE(HLINK(B285),\".aspx\",\"\")&IF(D$1=2013,\"(v=ocs.15).aspx\",\"(v=ocs.14).aspx\"),B285)),\"\")","v":"New-CsDiagnosticsFilter"},"Creates a new diagnostic filter to be used with diagnostic configuration settings. Diagnostic configuration settings are used to determine whether traffic to or from a given domain or Uniform Resource Identifier (URI) is recorded in your Microsoft Lync Server 2010 log files.","yes","no","no","no","no","no","yes","no","no","no","Get-CsAdminRole | ? {$_.Cmdlets –match \"New-CsDiagnosticsFilter\"}"]
["New-CsDialInConferencingAccessNumber","New-CsDialInConferencingAccessNumber",{"$f":"IF(ISTEXT(A286),(HYPERLINK(SUBSTITUTE(HLINK(A286),\".aspx\",\"\")&IF(C$1=2013,\"(v=ocs.15).aspx\",\"(v=ocs.14).aspx\"),A286)),\"\")","v":"New-CsDialInConferencingAccessNumber"},{"$f":"IF(ISTEXT(B286),(HYPERLINK(SUBSTITUTE(HLINK(B286),\".aspx\",\"\")&IF(D$1=2013,\"(v=ocs.15).aspx\",\"(v=ocs.14).aspx\"),B286)),\"\")","v":"New-CsDialInConferencingAccessNumber"},"Creates a new dial-in conferencing access number. Dial-in conferencing provides a way for users to use a \"regular\" telephone, cell phone or other device on the public switched telephone network (PSTN) to join the audio portion of a conference.","yes","no","no","no","no","no","yes","no","no","no","Get-CsAdminRole | ? {$_.Cmdlets –match \"New-CsDialInConferencingAccessNumber\"}"]
["New-CsDiagnosticsFilter","New-CsDiagnosticsFilter",{"$f":"IF(ISTEXT(A287),(HYPERLINK(SUBSTITUTE(HLINK(A287),\".aspx\",\"\")&IF(C$1=2013,\"(v=ocs.15).aspx\",\"(v=ocs.14).aspx\"),A287)),\"\")","v":"New-CsDiagnosticsFilter"},{"$f":"IF(ISTEXT(B287),(HYPERLINK(SUBSTITUTE(HLINK(B287),\".aspx\",\"\")&IF(D$1=2013,\"(v=ocs.15).aspx\",\"(v=ocs.14).aspx\"),B287)),\"\")","v":"New-CsDiagnosticsFilter"},"Creates a new diagnostic filter to be used with diagnostic configuration settings. Diagnostic configuration settings are used to determine whether traffic to or from a given domain or Uniform Resource Identifier (URI) is recorded in your Lync Server log files. This cmdlet was introduced in Lync Server 2010.","yes","no","no","no","no","no","yes","no","no","no","Get-CsAdminRole | ? {$_.Cmdlets –match \"New-CsDiagnosticsFilter\"}"]
["New-CsDialInConferencingAccessNumber","New-CsDialInConferencingAccessNumber",{"$f":"IF(ISTEXT(A288),(HYPERLINK(SUBSTITUTE(HLINK(A288),\".aspx\",\"\")&IF(C$1=2013,\"(v=ocs.15).aspx\",\"(v=ocs.14).aspx\"),A288)),\"\")","v":"New-CsDialInConferencingAccessNumber"},{"$f":"IF(ISTEXT(B288),(HYPERLINK(SUBSTITUTE(HLINK(B288),\".aspx\",\"\")&IF(D$1=2013,\"(v=ocs.15).aspx\",\"(v=ocs.14).aspx\"),B288)),\"\")","v":"New-CsDialInConferencingAccessNumber"},"Creates a new dial-in conferencing access number. Dial-in conferencing provides a way for users to use a \"regular\" telephone, cell phone or other device on the public switched telephone network (PSTN) to join the audio portion of a conference. This cmdlet was introduced in Lync Server 2010.","yes","no","no","no","no","no","yes","no","no","no","Get-CsAdminRole | ? {$_.Cmdlets –match \"New-CsDialInConferencingAccessNumber\"}"]
["New-CsDialInConferencingConfiguration","New-CsDialInConferencingConfiguration",{"$f":"IF(ISTEXT(A289),(HYPERLINK(SUBSTITUTE(HLINK(A289),\".aspx\",\"\")&IF(C$1=2013,\"(v=ocs.15).aspx\",\"(v=ocs.14).aspx\"),A289)),\"\")","v":"New-CsDialInConferencingConfiguration"},{"$f":"IF(ISTEXT(B289),(HYPERLINK(SUBSTITUTE(HLINK(B289),\".aspx\",\"\")&IF(D$1=2013,\"(v=ocs.15).aspx\",\"(v=ocs.14).aspx\"),B289)),\"\")","v":"New-CsDialInConferencingConfiguration"},"Creates a new collection of dial-in conferencing configuration settings. These settings determine how Microsoft Lync Server 2010 responds when users join or leave a dial-in conference. In particular, information is returned regarding whether or not participants are required to record their name when joining a conference, and how (or if) the system announces that someone has joined or left the call.","yes","no","no","no","no","no","yes","no","no","no",{"$f":"\"Get-CsAdminRole | ? {$_.Cmdlets –match \"& CHAR(34) &B289& CHAR(34) &\"}\"","v":"Get-CsAdminRole | ? {$_.Cmdlets –match \"New-CsDialInConferencingConfiguration\"}"}]
["New-CsDialInConferencingDtmfConfiguration","New-CsDialInConferencingDtmfConfiguration",{"$f":"IF(ISTEXT(A290),(HYPERLINK(SUBSTITUTE(HLINK(A290),\".aspx\",\"\")&IF(C$1=2013,\"(v=ocs.15).aspx\",\"(v=ocs.14).aspx\"),A290)),\"\")","v":"New-CsDialInConferencingDtmfConfiguration"},{"$f":"IF(ISTEXT(B290),(HYPERLINK(SUBSTITUTE(HLINK(B290),\".aspx\",\"\")&IF(D$1=2013,\"(v=ocs.15).aspx\",\"(v=ocs.14).aspx\"),B290)),\"\")","v":"New-CsDialInConferencingDtmfConfiguration"},"Creates a new collection of dual-tone multifrequency (DTMF) signaling settings used for dial-in conferencing. DTMF enables users who dial in to a conference to control conference settings (such as muting and unmuting themselves or locking and unlocking the conference) by using the keypad on their telephone.","yes","no","no","no","no","no","yes","no","no","no","Get-CsAdminRole | ? {$_.Cmdlets –match \"New-CsDialInConferencingDtmfConfiguration\"}"]
["New-CsDialPlan","New-CsDialPlan",{"$f":"IF(ISTEXT(A291),(HYPERLINK(SUBSTITUTE(HLINK(A291),\".aspx\",\"\")&IF(C$1=2013,\"(v=ocs.15).aspx\",\"(v=ocs.14).aspx\"),A291)),\"\")","v":"New-CsDialPlan"},{"$f":"IF(ISTEXT(B291),(HYPERLINK(SUBSTITUTE(HLINK(B291),\".aspx\",\"\")&IF(D$1=2013,\"(v=ocs.15).aspx\",\"(v=ocs.14).aspx\"),B291)),\"\")","v":"New-CsDialPlan"},"Creates a new dial plan.","yes","no","no","no","no","no","yes","no","no","yes","Get-CsAdminRole | ? {$_.Cmdlets –match \"New-CsDialPlan\"}"]
[null,"New-CsExtendedTest",{"$f":"IF(ISTEXT(A292),(HYPERLINK(SUBSTITUTE(HLINK(A292),\".aspx\",\"\")&IF(C$1=2013,\"(v=ocs.15).aspx\",\"(v=ocs.14).aspx\"),A292)),\"\")","v":""},{"$f":"IF(ISTEXT(B292),(HYPERLINK(SUBSTITUTE(HLINK(B292),\".aspx\",\"\")&IF(D$1=2013,\"(v=ocs.15).aspx\",\"(v=ocs.14).aspx\"),B292)),\"\")","v":"New-CsExtendedTest"},"Creates a PSTN or an Audio Conferencing Provider test that can then be assigned to a watcher node configuration. Watcher nodes are computers that periodically use Microsoft System Center Operations Manager and Lync Server 2013 synthetic transactions to verify that Lync Server components are working as expected. This cmdlet was introduced in Lync Server 2013.","yes","no","no","no","no","no","yes","no","no","no","Get-CsAdminRole | ? {$_.Cmdlets –match \"New-CsExtendedTest\"}"]
["New-CsExternalAccessPolicy","New-CsExternalAccessPolicy",{"$f":"IF(ISTEXT(A293),(HYPERLINK(SUBSTITUTE(HLINK(A293),\".aspx\",\"\")&IF(C$1=2013,\"(v=ocs.15).aspx\",\"(v=ocs.14).aspx\"),A293)),\"\")","v":"New-CsExternalAccessPolicy"},{"$f":"IF(ISTEXT(B293),(HYPERLINK(SUBSTITUTE(HLINK(B293),\".aspx\",\"\")&IF(D$1=2013,\"(v=ocs.15).aspx\",\"(v=ocs.14).aspx\"),B293)),\"\")","v":"New-CsExternalAccessPolicy"},"Enables you to create a new external access policy. External access policies determine whether or not your users can: 1) communicate with users who have Session Initiation Protocol (SIP) accounts with a federated organization; 2) communicate with users who have SIP accounts with a public instant messaging (IM) provider such as MSN; and, 3) access Microsoft Lync Server 2010 over the Internet, without having to log on to your internal network.","yes","no","no","no","no","no","yes","no","no","no","Get-CsAdminRole | ? {$_.Cmdlets –match \"New-CsExternalAccessPolicy\"}"]
["New-CsExUmContact","New-CsExUmContact",{"$f":"IF(ISTEXT(A294),(HYPERLINK(SUBSTITUTE(HLINK(A294),\".aspx\",\"\")&IF(C$1=2013,\"(v=ocs.15).aspx\",\"(v=ocs.14).aspx\"),A294)),\"\")","v":"New-CsExUmContact"},{"$f":"IF(ISTEXT(B294),(HYPERLINK(SUBSTITUTE(HLINK(B294),\".aspx\",\"\")&IF(D$1=2013,\"(v=ocs.15).aspx\",\"(v=ocs.14).aspx\"),B294)),\"\")","v":"New-CsExUmContact"},"Creates a new Auto Attendant or Subscriber Access contact object for hosted Exchange Unified Messaging (UM).","yes","no","no","no","no","no","yes","yes","no","yes","Get-CsAdminRole | ? {$_.Cmdlets –match \"New-CsExUmContact\"}"]
["New-CsFileTransferFilterConfiguration","New-CsFileTransferFilterConfiguration",{"$f":"IF(ISTEXT(A295),(HYPERLINK(SUBSTITUTE(HLINK(A295),\".aspx\",\"\")&IF(C$1=2013,\"(v=ocs.15).aspx\",\"(v=ocs.14).aspx\"),A295)),\"\")","v":"New-CsFileTransferFilterConfiguration"},{"$f":"IF(ISTEXT(B295),(HYPERLINK(SUBSTITUTE(HLINK(B295),\".aspx\",\"\")&IF(D$1=2013,\"(v=ocs.15).aspx\",\"(v=ocs.14).aspx\"),B295)),\"\")","v":"New-CsFileTransferFilterConfiguration"},"Creates a new file transfer filter configuration. File transfer filter configurations are used to block a user's ability to transfer certain types of files (for example, files with a .vbs or .ps1 file extension) using a Microsoft Lync Server 2010 client.","yes","no","no","no","no","no","yes","no","no","no","Get-CsAdminRole | ? {$_.Cmdlets –match \"New-CsFileTransferFilterConfiguration\"}"]
[null,"New-CsFIPSConfiguration",{"$f":"IF(ISTEXT(A296),(HYPERLINK(SUBSTITUTE(HLINK(A296),\".aspx\",\"\")&IF(C$1=2013,\"(v=ocs.15).aspx\",\"(v=ocs.14).aspx\"),A296)),\"\")","v":""},{"$f":"IF(ISTEXT(B296),(HYPERLINK(SUBSTITUTE(HLINK(B296),\".aspx\",\"\")&IF(D$1=2013,\"(v=ocs.15).aspx\",\"(v=ocs.14).aspx\"),B296)),\"\")","v":"New-CsFIPSConfiguration"},"Creates a new collection of Federal Information Processing Standards (FIPS) configuration settings. The FIPS standards are a set of United States government security standards required for use in computers maintained by non-military government agencies and by government contractors. This cmdlet was introduced in Lync Server 2013.","yes","no","no","no","no","no","yes","no","no","no","Get-CsAdminRole | ? {$_.Cmdlets –match \"New-CsFIPSConfiguration\"}"]
["New-CsHealthMonitoringConfiguration","New-CsHealthMonitoringConfiguration",{"$f":"IF(ISTEXT(A297),(HYPERLINK(SUBSTITUTE(HLINK(A297),\".aspx\",\"\")&IF(C$1=2013,\"(v=ocs.15).aspx\",\"(v=ocs.14).aspx\"),A297)),\"\")","v":"New-CsHealthMonitoringConfiguration"},{"$f":"IF(ISTEXT(B297),(HYPERLINK(SUBSTITUTE(HLINK(B297),\".aspx\",\"\")&IF(D$1=2013,\"(v=ocs.15).aspx\",\"(v=ocs.14).aspx\"),B297)),\"\")","v":"New-CsHealthMonitoringConfiguration"},"Creates a new collection of health monitoring configuration settings for use in your organization. These settings enable administrators to run quality assurance tests without having to supply the user names and passwords for the required test accounts.","yes","no","no","no","no","no","yes","no","no","no","Get-CsAdminRole | ? {$_.Cmdlets –match \"New-CsHealthMonitoringConfiguration\"}"]
["New-CsHostedVoicemailPolicy","New-CsHostedVoicemailPolicy",{"$f":"IF(ISTEXT(A298),(HYPERLINK(SUBSTITUTE(HLINK(A298),\".aspx\",\"\")&IF(C$1=2013,\"(v=ocs.15).aspx\",\"(v=ocs.14).aspx\"),A298)),\"\")","v":"New-CsHostedVoicemailPolicy"},{"$f":"IF(ISTEXT(B298),(HYPERLINK(SUBSTITUTE(HLINK(B298),\".aspx\",\"\")&IF(D$1=2013,\"(v=ocs.15).aspx\",\"(v=ocs.14).aspx\"),B298)),\"\")","v":"New-CsHostedVoicemailPolicy"},"Creates a new hosted voice mail policy.","yes","no","no","no","no","no","yes","no","no","yes","Get-CsAdminRole | ? {$_.Cmdlets –match \"New-CsHostedVoicemailPolicy\"}"]
["New-CsHostingProvider","New-CsHostingProvider",{"$f":"IF(ISTEXT(A299),(HYPERLINK(SUBSTITUTE(HLINK(A299),\".aspx\",\"\")&IF(C$1=2013,\"(v=ocs.15).aspx\",\"(v=ocs.14).aspx\"),A299)),\"\")","v":"New-CsHostingProvider"},{"$f":"IF(ISTEXT(B299),(HYPERLINK(SUBSTITUTE(HLINK(B299),\".aspx\",\"\")&IF(D$1=2013,\"(v=ocs.15).aspx\",\"(v=ocs.14).aspx\"),B299)),\"\")","v":"New-CsHostingProvider"},"Creates a new hosting provider for use in your organization. A hosting provider is a private third-party organization that provides instant messaging, presence, and related services for a domain that you would like to federate with. Hosting providers, such as Microsoft Lync Online 2010, differ from public providers (such as Yahoo!, MSN, and AOL) in that their services are not offered to the general public.","yes","no","no","no","no","no","yes","no","no","no","Get-CsAdminRole | ? {$_.Cmdlets –match \"New-CsHostingProvider\"}"]
["New-CsImFilterConfiguration","New-CsImFilterConfiguration",{"$f":"IF(ISTEXT(A300),(HYPERLINK(SUBSTITUTE(HLINK(A300),\".aspx\",\"\")&IF(C$1=2013,\"(v=ocs.15).aspx\",\"(v=ocs.14).aspx\"),A300)),\"\")","v":"New-CsImFilterConfiguration"},{"$f":"IF(ISTEXT(B300),(HYPERLINK(SUBSTITUTE(HLINK(B300),\".aspx\",\"\")&IF(D$1=2013,\"(v=ocs.15).aspx\",\"(v=ocs.14).aspx\"),B300)),\"\")","v":"New-CsImFilterConfiguration"},"Creates a new instant messaging (IM) filter configuration. IM filters are used to prevent users from sending instant messages that contain active hyperlinks.","yes","no","no","no","no","no","yes","no","no","no","Get-CsAdminRole | ? {$_.Cmdlets –match \"New-CsImFilterConfiguration\"}"]
["New-CsIssuedCertId","New-CsIssuedCertId",{"$f":"IF(ISTEXT(A301),(HYPERLINK(SUBSTITUTE(HLINK(A301),\".aspx\",\"\")&IF(C$1=2013,\"(v=ocs.15).aspx\",\"(v=ocs.14).aspx\"),A301)),\"\")","v":"New-CsIssuedCertId"},{"$f":"IF(ISTEXT(B301),(HYPERLINK(SUBSTITUTE(HLINK(B301),\".aspx\",\"\")&IF(D$1=2013,\"(v=ocs.15).aspx\",\"(v=ocs.14).aspx\"),B301)),\"\")","v":"New-CsIssuedCertId"},"Enables you to assign an existing certificate to a SipProxy.TLS object. In turn, that object can be used configure a static route to use Transport Layer Security (TLS) as its transport protocol.","yes","no","no","no","no","no","yes","no","no","no","Get-CsAdminRole | ? {$_.Cmdlets –match \"New-CsIssuedCertId\"}"]
["New-CsKerberosAccount","New-CsKerberosAccount",{"$f":"IF(ISTEXT(A302),(HYPERLINK(SUBSTITUTE(HLINK(A302),\".aspx\",\"\")&IF(C$1=2013,\"(v=ocs.15).aspx\",\"(v=ocs.14).aspx\"),A302)),\"\")","v":"New-CsKerberosAccount"},{"$f":"IF(ISTEXT(B302),(HYPERLINK(SUBSTITUTE(HLINK(B302),\".aspx\",\"\")&IF(D$1=2013,\"(v=ocs.15).aspx\",\"(v=ocs.14).aspx\"),B302)),\"\")","v":"New-CsKerberosAccount"},"Creates a new Kerberos account used for Internet Information Services (IIS) authentication.","no","no","no","no","no","no","no","no","no","no","Get-CsAdminRole | ? {$_.Cmdlets –match \"New-CsKerberosAccount\"}"]
["New-CsKerberosAccountAssignment","New-CsKerberosAccountAssignment",{"$f":"IF(ISTEXT(A303),(HYPERLINK(SUBSTITUTE(HLINK(A303),\".aspx\",\"\")&IF(C$1=2013,\"(v=ocs.15).aspx\",\"(v=ocs.14).aspx\"),A303)),\"\")","v":"New-CsKerberosAccountAssignment"},{"$f":"IF(ISTEXT(B303),(HYPERLINK(SUBSTITUTE(HLINK(B303),\".aspx\",\"\")&IF(D$1=2013,\"(v=ocs.15).aspx\",\"(v=ocs.14).aspx\"),B303)),\"\")","v":"New-CsKerberosAccountAssignment"},"Assigns a Kerberos account, which is used for Internet Information Services (IIS) authentication, to a site.","no","no","no","no","no","no","no","no","no","no","Get-CsAdminRole | ? {$_.Cmdlets –match \"New-CsKerberosAccountAssignment\"}"]
["New-CsLocationPolicy","New-CsLocationPolicy",{"$f":"IF(ISTEXT(A304),(HYPERLINK(SUBSTITUTE(HLINK(A304),\".aspx\",\"\")&IF(C$1=2013,\"(v=ocs.15).aspx\",\"(v=ocs.14).aspx\"),A304)),\"\")","v":"New-CsLocationPolicy"},{"$f":"IF(ISTEXT(B304),(HYPERLINK(SUBSTITUTE(HLINK(B304),\".aspx\",\"\")&IF(D$1=2013,\"(v=ocs.15).aspx\",\"(v=ocs.14).aspx\"),B304)),\"\")","v":"New-CsLocationPolicy"},"Creates a new location policy for use with location identification for the Enhanced 9-1-1 (E9-1-1) service and general client location. The E9-1-1 service enables those who answer 911 calls to determine the caller's geographic location.","yes","no","no","no","no","no","yes","no","no","yes","Get-CsAdminRole | ? {$_.Cmdlets –match \"New-CsLocationPolicy\"}"]
["New-CsMcxConfiguration","New-CsMcxConfiguration",{"$f":"IF(ISTEXT(A305),(HYPERLINK(SUBSTITUTE(HLINK(A305),\".aspx\",\"\")&IF(C$1=2013,\"(v=ocs.15).aspx\",\"(v=ocs.14).aspx\"),A305)),\"\")","v":"New-CsMcxConfiguration"},{"$f":"IF(ISTEXT(B305),(HYPERLINK(SUBSTITUTE(HLINK(B305),\".aspx\",\"\")&IF(D$1=2013,\"(v=ocs.15).aspx\",\"(v=ocs.14).aspx\"),B305)),\"\")","v":"New-CsMcxConfiguration"},"Creates a new collection of Lync Server 2013 Mobility Service configuration settings at the site or the service scope. The Mobility Service enables users of mobile phones such as iPhones and Windows Phones to do such things as exchange instant messages and presence information; store and retrieve voice mail internally instead of with their wireless provider; and take advantage of Lync Server capabilities such as Call via Work and dial-out conferencing. This cmdlet was introduced in the cumulative update for Lync Server 2010: November 2011.","yes","no","no","no","no","no","yes","no","no","yes","Get-CsAdminRole | ? {$_.Cmdlets –match \"New-CsMcxConfiguration\"}"]
["New-CsMediaConfiguration","New-CsMediaConfiguration",{"$f":"IF(ISTEXT(A306),(HYPERLINK(SUBSTITUTE(HLINK(A306),\".aspx\",\"\")&IF(C$1=2013,\"(v=ocs.15).aspx\",\"(v=ocs.14).aspx\"),A306)),\"\")","v":"New-CsMediaConfiguration"},{"$f":"IF(ISTEXT(B306),(HYPERLINK(SUBSTITUTE(HLINK(B306),\".aspx\",\"\")&IF(D$1=2013,\"(v=ocs.15).aspx\",\"(v=ocs.14).aspx\"),B306)),\"\")","v":"New-CsMediaConfiguration"},"Creates a new collection of media settings. These settings can be used to specify such things as the supported level of encryption and the maximum allowed video resolution.","yes","no","no","no","no","no","yes","no","no","yes","Get-CsAdminRole | ? {$_.Cmdlets –match \"New-CsMediaConfiguration\"}"]
["New-CsMeetingConfiguration","New-CsMeetingConfiguration",{"$f":"IF(ISTEXT(A307),(HYPERLINK(SUBSTITUTE(HLINK(A307),\".aspx\",\"\")&IF(C$1=2013,\"(v=ocs.15).aspx\",\"(v=ocs.14).aspx\"),A307)),\"\")","v":"New-CsMeetingConfiguration"},{"$f":"IF(ISTEXT(B307),(HYPERLINK(SUBSTITUTE(HLINK(B307),\".aspx\",\"\")&IF(D$1=2013,\"(v=ocs.15).aspx\",\"(v=ocs.14).aspx\"),B307)),\"\")","v":"New-CsMeetingConfiguration"},"Creates a new collection of meeting configuration settings at the site or service scope. Meeting configuration settings help dictate the type of meetings (also called \"conferences\") that users can create, in addition to controlling how (or even if) anonymous users and dial-in conferencing users can join these meetings.","yes","no","no","no","no","no","yes","no","no","no","Get-CsAdminRole | ? {$_.Cmdlets –match \"New-CsMeetingConfiguration\"}"]
["New-CsMobilityPolicy","New-CsMobilityPolicy",{"$f":"IF(ISTEXT(A308),(HYPERLINK(SUBSTITUTE(HLINK(A308),\".aspx\",\"\")&IF(C$1=2013,\"(v=ocs.15).aspx\",\"(v=ocs.14).aspx\"),A308)),\"\")","v":"New-CsMobilityPolicy"},{"$f":"IF(ISTEXT(B308),(HYPERLINK(SUBSTITUTE(HLINK(B308),\".aspx\",\"\")&IF(D$1=2013,\"(v=ocs.15).aspx\",\"(v=ocs.14).aspx\"),B308)),\"\")","v":"New-CsMobilityPolicy"},"Creates a new mobility policy at the site or the per-user scope. Mobility policies determine whether or not a user can use Lync Mobile. These policies also manage a user's ability to employ Call via Work, a feature that enables users to make and receive phone calls on their mobile phone by using their work phone number instead of their mobile phone number. Mobility policies can also be used to require Wi-Fi connections when making or receiving calls. This cmdlet was introduced in the cumulative update for Lync Server 2010: November 2011.","yes","no","no","no","no","no","yes","no","no","no","Get-CsAdminRole | ? {$_.Cmdlets –match \"New-CsMobilityPolicy\"}"]
["New-CsNetworkBandwidthPolicyProfile","New-CsNetworkBandwidthPolicyProfile",{"$f":"IF(ISTEXT(A309),(HYPERLINK(SUBSTITUTE(HLINK(A309),\".aspx\",\"\")&IF(C$1=2013,\"(v=ocs.15).aspx\",\"(v=ocs.14).aspx\"),A309)),\"\")","v":"New-CsNetworkBandwidthPolicyProfile"},{"$f":"IF(ISTEXT(B309),(HYPERLINK(SUBSTITUTE(HLINK(B309),\".aspx\",\"\")&IF(D$1=2013,\"(v=ocs.15).aspx\",\"(v=ocs.14).aspx\"),B309)),\"\")","v":"New-CsNetworkBandwidthPolicyProfile"},"Creates a new network bandwidth policy profile. This cmdlet can also be used to set the bandwidth policies within the profile.","yes","no","no","no","no","no","yes","no","no","yes","Get-CsAdminRole | ? {$_.Cmdlets –match \"New-CsNetworkBandwidthPolicyProfile\"}"]
["New-CsNetworkBWAlternatePath","New-CsNetworkBWAlternatePath",{"$f":"IF(ISTEXT(A310),(HYPERLINK(SUBSTITUTE(HLINK(A310),\".aspx\",\"\")&IF(C$1=2013,\"(v=ocs.15).aspx\",\"(v=ocs.14).aspx\"),A310)),\"\")","v":"New-CsNetworkBWAlternatePath"},{"$f":"IF(ISTEXT(B310),(HYPERLINK(SUBSTITUTE(HLINK(B310),\".aspx\",\"\")&IF(D$1=2013,\"(v=ocs.15).aspx\",\"(v=ocs.14).aspx\"),B310)),\"\")","v":"New-CsNetworkBWAlternatePath"},"Creates new settings that define whether media can be routed to alternate paths through the Internet for bandwidth-constrained connections.","yes","no","no","no","no","no","yes","no","no","yes","Get-CsAdminRole | ? {$_.Cmdlets –match \"New-CsNetworkBWAlternatePath\"}"]
["New-CsNetworkBWPolicy","New-CsNetworkBWPolicy",{"$f":"IF(ISTEXT(A311),(HYPERLINK(SUBSTITUTE(HLINK(A311),\".aspx\",\"\")&IF(C$1=2013,\"(v=ocs.15).aspx\",\"(v=ocs.14).aspx\"),A311)),\"\")","v":"New-CsNetworkBWPolicy"},{"$f":"IF(ISTEXT(B311),(HYPERLINK(SUBSTITUTE(HLINK(B311),\".aspx\",\"\")&IF(D$1=2013,\"(v=ocs.15).aspx\",\"(v=ocs.14).aspx\"),B311)),\"\")","v":"New-CsNetworkBWPolicy"},"Creates a bandwidth policy in memory that can be applied to the bandwidth policy profile. In Microsoft Lync Server 2010, the policy applies to either audio or video bandwidth.","yes","no","no","no","no","no","yes","no","no","yes","Get-CsAdminRole | ? {$_.Cmdlets –match \"New-CsNetworkBWPolicy\"}"]
["New-CsNetworkInterRegionRoute","New-CsNetworkInterRegionRoute",{"$f":"IF(ISTEXT(A312),(HYPERLINK(SUBSTITUTE(HLINK(A312),\".aspx\",\"\")&IF(C$1=2013,\"(v=ocs.15).aspx\",\"(v=ocs.14).aspx\"),A312)),\"\")","v":"New-CsNetworkInterRegionRoute"},{"$f":"IF(ISTEXT(B312),(HYPERLINK(SUBSTITUTE(HLINK(B312),\".aspx\",\"\")&IF(D$1=2013,\"(v=ocs.15).aspx\",\"(v=ocs.14).aspx\"),B312)),\"\")","v":"New-CsNetworkInterRegionRoute"},"Creates a new route that connects network regions within a call admission control (CAC) configuration.","yes","no","no","no","no","no","yes","no","no","yes","Get-CsAdminRole | ? {$_.Cmdlets –match \"New-CsNetworkInterRegionRoute\"}"]
["New-CsNetworkInterSitePolicy","New-CsNetworkInterSitePolicy",{"$f":"IF(ISTEXT(A313),(HYPERLINK(SUBSTITUTE(HLINK(A313),\".aspx\",\"\")&IF(C$1=2013,\"(v=ocs.15).aspx\",\"(v=ocs.14).aspx\"),A313)),\"\")","v":"New-CsNetworkInterSitePolicy"},{"$f":"IF(ISTEXT(B313),(HYPERLINK(SUBSTITUTE(HLINK(B313),\".aspx\",\"\")&IF(D$1=2013,\"(v=ocs.15).aspx\",\"(v=ocs.14).aspx\"),B313)),\"\")","v":"New-CsNetworkInterSitePolicy"},"Creates a new network inter-site policy that defines bandwidth limitations between sites that are directly linked within a call admission control (CAC) configuration.","yes","no","no","no","no","no","yes","no","no","yes","Get-CsAdminRole | ? {$_.Cmdlets –match \"New-CsNetworkInterSitePolicy\"}"]
["New-CsNetworkMediaBypassConfiguration","New-CsNetworkMediaBypassConfiguration",{"$f":"IF(ISTEXT(A314),(HYPERLINK(SUBSTITUTE(HLINK(A314),\".aspx\",\"\")&IF(C$1=2013,\"(v=ocs.15).aspx\",\"(v=ocs.14).aspx\"),A314)),\"\")","v":"New-CsNetworkMediaBypassConfiguration"},{"$f":"IF(ISTEXT(B314),(HYPERLINK(SUBSTITUTE(HLINK(B314),\".aspx\",\"\")&IF(D$1=2013,\"(v=ocs.15).aspx\",\"(v=ocs.14).aspx\"),B314)),\"\")","v":"New-CsNetworkMediaBypassConfiguration"},"Creates new global settings for media bypass.","yes","no","no","no","no","no","yes","no","no","yes","Get-CsAdminRole | ? {$_.Cmdlets –match \"New-CsNetworkMediaBypassConfiguration\"}"]
["New-CsNetworkRegion","New-CsNetworkRegion",{"$f":"IF(ISTEXT(A315),(HYPERLINK(SUBSTITUTE(HLINK(A315),\".aspx\",\"\")&IF(C$1=2013,\"(v=ocs.15).aspx\",\"(v=ocs.14).aspx\"),A315)),\"\")","v":"New-CsNetworkRegion"},{"$f":"IF(ISTEXT(B315),(HYPERLINK(SUBSTITUTE(HLINK(B315),\".aspx\",\"\")&IF(D$1=2013,\"(v=ocs.15).aspx\",\"(v=ocs.14).aspx\"),B315)),\"\")","v":"New-CsNetworkRegion"},"Creates a new network region. Network regions represent network hubs or backbones in an enterprise network.","yes","no","no","no","no","no","yes","no","no","yes","Get-CsAdminRole | ? {$_.Cmdlets –match \"New-CsNetworkRegion\"}"]
["New-CsNetworkRegionLink","New-CsNetworkRegionLink",{"$f":"IF(ISTEXT(A316),(HYPERLINK(SUBSTITUTE(HLINK(A316),\".aspx\",\"\")&IF(C$1=2013,\"(v=ocs.15).aspx\",\"(v=ocs.14).aspx\"),A316)),\"\")","v":"New-CsNetworkRegionLink"},{"$f":"IF(ISTEXT(B316),(HYPERLINK(SUBSTITUTE(HLINK(B316),\".aspx\",\"\")&IF(D$1=2013,\"(v=ocs.15).aspx\",\"(v=ocs.14).aspx\"),B316)),\"\")","v":"New-CsNetworkRegionLink"},"Creates a link between two regions configured for call admission control (CAC).","yes","no","no","no","no","no","yes","no","no","yes","Get-CsAdminRole | ? {$_.Cmdlets –match \"New-CsNetworkRegionLink\"}"]
["New-CsNetworkSite","New-CsNetworkSite",{"$f":"IF(ISTEXT(A317),(HYPERLINK(SUBSTITUTE(HLINK(A317),\".aspx\",\"\")&IF(C$1=2013,\"(v=ocs.15).aspx\",\"(v=ocs.14).aspx\"),A317)),\"\")","v":"New-CsNetworkSite"},{"$f":"IF(ISTEXT(B317),(HYPERLINK(SUBSTITUTE(HLINK(B317),\".aspx\",\"\")&IF(D$1=2013,\"(v=ocs.15).aspx\",\"(v=ocs.14).aspx\"),B317)),\"\")","v":"New-CsNetworkSite"},"Creates a new network site for use with call admission control (CAC) or Enhanced 9-1-1 (E9-1-1).","yes","no","no","yes","no","no","yes","no","no","yes","Get-CsAdminRole | ? {$_.Cmdlets –match \"New-CsNetworkSite\"}"]
["New-CsNetworkSubnet","New-CsNetworkSubnet",{"$f":"IF(ISTEXT(A318),(HYPERLINK(SUBSTITUTE(HLINK(A318),\".aspx\",\"\")&IF(C$1=2013,\"(v=ocs.15).aspx\",\"(v=ocs.14).aspx\"),A318)),\"\")","v":"New-CsNetworkSubnet"},{"$f":"IF(ISTEXT(B318),(HYPERLINK(SUBSTITUTE(HLINK(B318),\".aspx\",\"\")&IF(D$1=2013,\"(v=ocs.15).aspx\",\"(v=ocs.14).aspx\"),B318)),\"\")","v":"New-CsNetworkSubnet"},"Creates a new network subnet.","yes","no","no","yes","no","no","yes","no","no","yes","Get-CsAdminRole | ? {$_.Cmdlets –match \"New-CsNetworkSubnet\"}"]
[null,"New-CsOAuthServer",{"$f":"IF(ISTEXT(A319),(HYPERLINK(SUBSTITUTE(HLINK(A319),\".aspx\",\"\")&IF(C$1=2013,\"(v=ocs.15).aspx\",\"(v=ocs.14).aspx\"),A319)),\"\")","v":""},{"$f":"IF(ISTEXT(B319),(HYPERLINK(SUBSTITUTE(HLINK(B319),\".aspx\",\"\")&IF(D$1=2013,\"(v=ocs.15).aspx\",\"(v=ocs.14).aspx\"),B319)),\"\")","v":"New-CsOAuthServer"},"Creates a new Open Authorization (OAuth) server for use by the organization. OAuth servers, also known as security token servers, issue security tokens used in server-to-server authentication and authorization. This cmdlet was introduced in Lync Server 2013.","yes","no","no","no","no","no","yes","no","no","no","Get-CsAdminRole | ? {$_.Cmdlets –match \"New-CsOAuthServer\"}"]
[null,"New-CsOutboundCallingNumberTranslationRule",{"$f":"IF(ISTEXT(A320),(HYPERLINK(SUBSTITUTE(HLINK(A320),\".aspx\",\"\")&IF(C$1=2013,\"(v=ocs.15).aspx\",\"(v=ocs.14).aspx\"),A320)),\"\")","v":""},{"$f":"IF(ISTEXT(B320),(HYPERLINK(SUBSTITUTE(HLINK(B320),\".aspx\",\"\")&IF(D$1=2013,\"(v=ocs.15).aspx\",\"(v=ocs.14).aspx\"),B320)),\"\")","v":"New-CsOutboundCallingNumberTranslationRule"},"Creates a new outbound calling number translation rule. An outbound calling number translation rule converts the E.164 phone numbers used by Lync Server 2013 to a format that can be used by trunking peers that do not support E.164 numbers. This cmdlet was introduced in Lync Server 2013.","yes","no","no","no","no","no","yes","no","no","yes","Get-CsAdminRole | ? {$_.Cmdlets –match \"New-CsOutboundCallingNumberTranslationRule\"}"]
["New-CsOutboundTranslationRule","New-CsOutboundTranslationRule",{"$f":"IF(ISTEXT(A321),(HYPERLINK(SUBSTITUTE(HLINK(A321),\".aspx\",\"\")&IF(C$1=2013,\"(v=ocs.15).aspx\",\"(v=ocs.14).aspx\"),A321)),\"\")","v":"New-CsOutboundTranslationRule"},{"$f":"IF(ISTEXT(B321),(HYPERLINK(SUBSTITUTE(HLINK(B321),\".aspx\",\"\")&IF(D$1=2013,\"(v=ocs.15).aspx\",\"(v=ocs.14).aspx\"),B321)),\"\")","v":"New-CsOutboundTranslationRule"},"Creates a new outbound translation rule. An outbound translation rule converts phone numbers to the local dialing format for interaction with private branch exchange (PBX) systems.","yes","no","no","no","no","no","yes","no","no","yes","Get-CsAdminRole | ? {$_.Cmdlets –match \"New-CsOutboundTranslationRule\"}"]
[null,"New-CsPartnerApplication",{"$f":"IF(ISTEXT(A322),(HYPERLINK(SUBSTITUTE(HLINK(A322),\".aspx\",\"\")&IF(C$1=2013,\"(v=ocs.15).aspx\",\"(v=ocs.14).aspx\"),A322)),\"\")","v":""},{"$f":"IF(ISTEXT(B322),(HYPERLINK(SUBSTITUTE(HLINK(B322),\".aspx\",\"\")&IF(D$1=2013,\"(v=ocs.15).aspx\",\"(v=ocs.14).aspx\"),B322)),\"\")","v":"New-CsPartnerApplication"},"Creates a new partner application. A partner application is any application that Lync Server 2013 can directly exchange security tokens with, without having to go through a third-party security token server. This cmdlet was introduced in Lync Server 2013.","yes","no","no","no","no","no","yes","no","no","no","Get-CsAdminRole | ? {$_.Cmdlets –match \"New-CsPartnerApplication\"}"]
[null,"New-CsPersistentChatAddin",{"$f":"IF(ISTEXT(A323),(HYPERLINK(SUBSTITUTE(HLINK(A323),\".aspx\",\"\")&IF(C$1=2013,\"(v=ocs.15).aspx\",\"(v=ocs.14).aspx\"),A323)),\"\")","v":""},{"$f":"IF(ISTEXT(B323),(HYPERLINK(SUBSTITUTE(HLINK(B323),\".aspx\",\"\")&IF(D$1=2013,\"(v=ocs.15).aspx\",\"(v=ocs.14).aspx\"),B323)),\"\")","v":"New-CsPersistentChatAddin"},"Enables you to configure a new Persistent Chat add-in. A Persistent Chat add-in is a customized web page that can be embedded within a Persistent Chat client. This cmdlet was introduced in Lync Server 2013.","yes","no","no","no","yes","no","yes","no","no","no","Get-CsAdminRole | ? {$_.Cmdlets –match \"New-CsPersistentChatAddin\"}"]
[null,"New-CsPersistentChatCategory",{"$f":"IF(ISTEXT(A324),(HYPERLINK(SUBSTITUTE(HLINK(A324),\".aspx\",\"\")&IF(C$1=2013,\"(v=ocs.15).aspx\",\"(v=ocs.14).aspx\"),A324)),\"\")","v":""},{"$f":"IF(ISTEXT(B324),(HYPERLINK(SUBSTITUTE(HLINK(B324),\".aspx\",\"\")&IF(D$1=2013,\"(v=ocs.15).aspx\",\"(v=ocs.14).aspx\"),B324)),\"\")","v":"New-CsPersistentChatCategory"},"Creates a new Persistent Chat category. A Persistent Chat category represents a collection of Persistent Chat chat rooms. Each chat room must be associated with a category. Note that you cannot assign chat rooms to a category when you create that category. Instead, existing rooms must later be assigned to a category by using the Set-CsPersistentChatRoom cmdlet. However, new chat rooms can be assigned to the category at the same time the room is created. This cmdlet was introduced in Lync Server 2013.","yes","no","no","no","yes","no","yes","no","no","no","Get-CsAdminRole | ? {$_.Cmdlets –match \"New-CsPersistentChatCategory\"}"]
[null,"New-CsPersistentChatComplianceConfiguration",{"$f":"IF(ISTEXT(A325),(HYPERLINK(SUBSTITUTE(HLINK(A325),\".aspx\",\"\")&IF(C$1=2013,\"(v=ocs.15).aspx\",\"(v=ocs.14).aspx\"),A325)),\"\")","v":""},{"$f":"IF(ISTEXT(B325),(HYPERLINK(SUBSTITUTE(HLINK(B325),\".aspx\",\"\")&IF(D$1=2013,\"(v=ocs.15).aspx\",\"(v=ocs.14).aspx\"),B325)),\"\")","v":"New-CsPersistentChatComplianceConfiguration"},"Creates a new collection of Persistent Chat compliance configuration settings at the site or the service scope. Persistent Chat compliance enables administrators to maintain an archive of Persistent Chat items and activities including: new messages; new events (for example, a user entering or existing a chat room); file uploads and downloads; and searches run against the chat history. This cmdlet was introduced in Lync Server 2013.","yes","yes","no","no","yes","no","yes","no","no","no","Get-CsAdminRole | ? {$_.Cmdlets –match \"New-CsPersistentChatComplianceConfiguration\"}"]
[null,"New-CsPersistentChatConfiguration",{"$f":"IF(ISTEXT(A326),(HYPERLINK(SUBSTITUTE(HLINK(A326),\".aspx\",\"\")&IF(C$1=2013,\"(v=ocs.15).aspx\",\"(v=ocs.14).aspx\"),A326)),\"\")","v":""},{"$f":"IF(ISTEXT(B326),(HYPERLINK(SUBSTITUTE(HLINK(B326),\".aspx\",\"\")&IF(D$1=2013,\"(v=ocs.15).aspx\",\"(v=ocs.14).aspx\"),B326)),\"\")","v":"New-CsPersistentChatConfiguration"},"Creates a new collection of Persistent Chat configuration settings at the site or service scope. Persistent Chat configuration settings are used to manage the Persistent Chat service. For example, these settings allow you to specify the maximum number of users who can participate in a chat room. This cmdlet was introduced in Lync Server 2013.","yes","no","no","no","yes","no","yes","no","no","no","Get-CsAdminRole | ? {$_.Cmdlets –match \"New-CsPersistentChatConfiguration\"}"]
[null,"New-CsPersistentChatEndpoint",{"$f":"IF(ISTEXT(A327),(HYPERLINK(SUBSTITUTE(HLINK(A327),\".aspx\",\"\")&IF(C$1=2013,\"(v=ocs.15).aspx\",\"(v=ocs.14).aspx\"),A327)),\"\")","v":""},{"$f":"IF(ISTEXT(B327),(HYPERLINK(SUBSTITUTE(HLINK(B327),\".aspx\",\"\")&IF(D$1=2013,\"(v=ocs.15).aspx\",\"(v=ocs.14).aspx\"),B327)),\"\")","v":"New-CsPersistentChatEndpoint"},"Creates a new Persistent Chat endpoint. A Persistent Chat endpoint is an Active Directory contact object provides a friendly URL for a Lync Server 2013 Persistent Chat pool. This cmdlet was introduced in Lync Server 2013.","yes","no","no","no","yes","no","yes","no","no","no","Get-CsAdminRole | ? {$_.Cmdlets –match \"New-CsPersistentChatEndpoint\"}"]
[null,"New-CsPersistentChatPolicy",{"$f":"IF(ISTEXT(A328),(HYPERLINK(SUBSTITUTE(HLINK(A328),\".aspx\",\"\")&IF(C$1=2013,\"(v=ocs.15).aspx\",\"(v=ocs.14).aspx\"),A328)),\"\")","v":""},{"$f":"IF(ISTEXT(B328),(HYPERLINK(SUBSTITUTE(HLINK(B328),\".aspx\",\"\")&IF(D$1=2013,\"(v=ocs.15).aspx\",\"(v=ocs.14).aspx\"),B328)),\"\")","v":"New-CsPersistentChatPolicy"},"Creates a new Persistent Chat policy at the site or the per-user scope. Persistent Chat policies determine whether or not users are allowed access to Persistent Chat chat rooms. This cmdlet was introduced in Lync Server 2013.","yes","no","no","no","yes","no","yes","no","no","no","Get-CsAdminRole | ? {$_.Cmdlets –match \"New-CsPersistentChatPolicy\"}"]
[null,"New-CsPersistentChatRoom",{"$f":"IF(ISTEXT(A329),(HYPERLINK(SUBSTITUTE(HLINK(A329),\".aspx\",\"\")&IF(C$1=2013,\"(v=ocs.15).aspx\",\"(v=ocs.14).aspx\"),A329)),\"\")","v":""},{"$f":"IF(ISTEXT(B329),(HYPERLINK(SUBSTITUTE(HLINK(B329),\".aspx\",\"\")&IF(D$1=2013,\"(v=ocs.15).aspx\",\"(v=ocs.14).aspx\"),B329)),\"\")","v":"New-CsPersistentChatRoom"},"Creates a new Persistent Chat chat room. A chat room is a discussion forum that typically revolves around a specific topic. This cmdlet was introduced in Lync Server 2013.","yes","no","no","no","yes","no","yes","no","no","no","Get-CsAdminRole | ? {$_.Cmdlets –match \"New-CsPersistentChatRoom\"}"]
["New-CsPinPolicy","New-CsPinPolicy",{"$f":"IF(ISTEXT(A330),(HYPERLINK(SUBSTITUTE(HLINK(A330),\".aspx\",\"\")&IF(C$1=2013,\"(v=ocs.15).aspx\",\"(v=ocs.14).aspx\"),A330)),\"\")","v":"New-CsPinPolicy"},{"$f":"IF(ISTEXT(B330),(HYPERLINK(SUBSTITUTE(HLINK(B330),\".aspx\",\"\")&IF(D$1=2013,\"(v=ocs.15).aspx\",\"(v=ocs.14).aspx\"),B330)),\"\")","v":"New-CsPinPolicy"},"Creates a new client personal identification number (PIN) policy. PIN authentication enables users to access Microsoft Lync Server 2010 by providing a PIN instead of a user name and password.","yes","no","no","no","no","no","yes","no","no","no","Get-CsAdminRole | ? {$_.Cmdlets –match \"New-CsPinPolicy\"}"]
["New-CsPresencePolicy","New-CsPresencePolicy",{"$f":"IF(ISTEXT(A331),(HYPERLINK(SUBSTITUTE(HLINK(A331),\".aspx\",\"\")&IF(C$1=2013,\"(v=ocs.15).aspx\",\"(v=ocs.14).aspx\"),A331)),\"\")","v":"New-CsPresencePolicy"},{"$f":"IF(ISTEXT(B331),(HYPERLINK(SUBSTITUTE(HLINK(B331),\".aspx\",\"\")&IF(D$1=2013,\"(v=ocs.15).aspx\",\"(v=ocs.14).aspx\"),B331)),\"\")","v":"New-CsPresencePolicy"},"Creates a new presence policy at either the site scope or the per-user scope.","yes","no","no","no","no","no","yes","no","no","no",{"$f":"\"Get-CsAdminRole | ? {$_.Cmdlets –match \"& CHAR(34) &B331& CHAR(34) &\"}\"","v":"Get-CsAdminRole | ? {$_.Cmdlets –match \"New-CsPresencePolicy\"}"}]
[null,"New-CsPresenceProvider",{"$f":"IF(ISTEXT(A332),(HYPERLINK(SUBSTITUTE(HLINK(A332),\".aspx\",\"\")&IF(C$1=2013,\"(v=ocs.15).aspx\",\"(v=ocs.14).aspx\"),A332)),\"\")","v":""},{"$f":"IF(ISTEXT(B332),(HYPERLINK(SUBSTITUTE(HLINK(B332),\".aspx\",\"\")&IF(D$1=2013,\"(v=ocs.15).aspx\",\"(v=ocs.14).aspx\"),B332)),\"\")","v":"New-CsPresenceProvider"},"Authorizes a new presence provider for use in the organization. Presence providers represent the PresenceProviders property of a collection of user services configuration settings. This cmdlet was introduced in Lync Server 2013.","yes","no","no","no","no","no","yes","no","no","no","Get-CsAdminRole | ? {$_.Cmdlets –match \"New-CsPresenceProvider\"}"]
["New-CsPrivacyConfiguration","New-CsPrivacyConfiguration",{"$f":"IF(ISTEXT(A333),(HYPERLINK(SUBSTITUTE(HLINK(A333),\".aspx\",\"\")&IF(C$1=2013,\"(v=ocs.15).aspx\",\"(v=ocs.14).aspx\"),A333)),\"\")","v":"New-CsPrivacyConfiguration"},{"$f":"IF(ISTEXT(B333),(HYPERLINK(SUBSTITUTE(HLINK(B333),\".aspx\",\"\")&IF(D$1=2013,\"(v=ocs.15).aspx\",\"(v=ocs.14).aspx\"),B333)),\"\")","v":"New-CsPrivacyConfiguration"},"Creates a new collection of privacy configuration settings. Privacy configuration settings help determine how much information users make available to other users.","yes","no","no","no","no","no","yes","no","no","no","Get-CsAdminRole | ? {$_.Cmdlets –match \"New-CsPrivacyConfiguration\"}"]
["New-CsProxyConfiguration","New-CsProxyConfiguration",{"$f":"IF(ISTEXT(A334),(HYPERLINK(SUBSTITUTE(HLINK(A334),\".aspx\",\"\")&IF(C$1=2013,\"(v=ocs.15).aspx\",\"(v=ocs.14).aspx\"),A334)),\"\")","v":"New-CsProxyConfiguration"},{"$f":"IF(ISTEXT(B334),(HYPERLINK(SUBSTITUTE(HLINK(B334),\".aspx\",\"\")&IF(D$1=2013,\"(v=ocs.15).aspx\",\"(v=ocs.14).aspx\"),B334)),\"\")","v":"New-CsProxyConfiguration"},"Creates a new collection of proxy configuration settings.","yes","no","no","no","no","no","yes","no","no","no","Get-CsAdminRole | ? {$_.Cmdlets –match \"New-CsProxyConfiguration\"}"]
["New-CsPublicProvider","New-CsPublicProvider",{"$f":"IF(ISTEXT(A335),(HYPERLINK(SUBSTITUTE(HLINK(A335),\".aspx\",\"\")&IF(C$1=2013,\"(v=ocs.15).aspx\",\"(v=ocs.14).aspx\"),A335)),\"\")","v":"New-CsPublicProvider"},{"$f":"IF(ISTEXT(B335),(HYPERLINK(SUBSTITUTE(HLINK(B335),\".aspx\",\"\")&IF(D$1=2013,\"(v=ocs.15).aspx\",\"(v=ocs.14).aspx\"),B335)),\"\")","v":"New-CsPublicProvider"},"Creates a federation relationship with a new public provider. A public provider is an organization that provides instant messaging, presence, and related services to the general public. Microsoft Lync Server 2010 ships with three public providers configured but not enabled: Yahoo!; AOL; and MSN.","yes","no","no","no","no","no","yes","no","no","no","Get-CsAdminRole | ? {$_.Cmdlets –match \"New-CsPublicProvider\"}"]
["New-CsPushNotificationConfiguration","New-CsPushNotificationConfiguration",{"$f":"IF(ISTEXT(A336),(HYPERLINK(SUBSTITUTE(HLINK(A336),\".aspx\",\"\")&IF(C$1=2013,\"(v=ocs.15).aspx\",\"(v=ocs.14).aspx\"),A336)),\"\")","v":"New-CsPushNotificationConfiguration"},{"$f":"IF(ISTEXT(B336),(HYPERLINK(SUBSTITUTE(HLINK(B336),\".aspx\",\"\")&IF(D$1=2013,\"(v=ocs.15).aspx\",\"(v=ocs.14).aspx\"),B336)),\"\")","v":"New-CsPushNotificationConfiguration"},"Creates a new collection of push notification configuration settings at the site scope. The push notification service (Apple Push Notification Service and Microsoft Push Notification Service) provides a way to send notifications about events such as new instant messages or new voice mail to mobile devices such as iPhones and Windows Phones, even if the Lync application on those devices is currently suspended or running in the background. This cmdlet was introduced in the cumulative update for Lync Server 2010: November 2011.","yes","no","no","no","no","no","yes","no","no","no","Get-CsAdminRole | ? {$_.Cmdlets –match \"New-CsPushNotificationConfiguration\"}"]
["New-CsQoEConfiguration","New-CsQoEConfiguration",{"$f":"IF(ISTEXT(A337),(HYPERLINK(SUBSTITUTE(HLINK(A337),\".aspx\",\"\")&IF(C$1=2013,\"(v=ocs.15).aspx\",\"(v=ocs.14).aspx\"),A337)),\"\")","v":"New-CsQoEConfiguration"},{"$f":"IF(ISTEXT(B337),(HYPERLINK(SUBSTITUTE(HLINK(B337),\".aspx\",\"\")&IF(D$1=2013,\"(v=ocs.15).aspx\",\"(v=ocs.14).aspx\"),B337)),\"\")","v":"New-CsQoEConfiguration"},"Creates a new collection of QoE (Quality of Experience) settings.","yes","no","no","no","no","no","yes","no","no","yes","Get-CsAdminRole | ? {$_.Cmdlets –match \"New-CsQoEConfiguration\"}"]
["New-CsRegistrarConfiguration","New-CsRegistrarConfiguration",{"$f":"IF(ISTEXT(A338),(HYPERLINK(SUBSTITUTE(HLINK(A338),\".aspx\",\"\")&IF(C$1=2013,\"(v=ocs.15).aspx\",\"(v=ocs.14).aspx\"),A338)),\"\")","v":"New-CsRegistrarConfiguration"},{"$f":"IF(ISTEXT(B338),(HYPERLINK(SUBSTITUTE(HLINK(B338),\".aspx\",\"\")&IF(D$1=2013,\"(v=ocs.15).aspx\",\"(v=ocs.14).aspx\"),B338)),\"\")","v":"New-CsRegistrarConfiguration"},"Creates a new collection of Registrar configuration settings. Registrars are used to authenticate logon requests and to maintain information about user status and availability.","yes","no","no","no","no","no","yes","no","no","no","Get-CsAdminRole | ? {$_.Cmdlets –match \"New-CsRegistrarConfiguration\"}"]
[null,"New-CsReportingConfiguration",{"$f":"IF(ISTEXT(A339),(HYPERLINK(SUBSTITUTE(HLINK(A339),\".aspx\",\"\")&IF(C$1=2013,\"(v=ocs.15).aspx\",\"(v=ocs.14).aspx\"),A339)),\"\")","v":""},{"$f":"IF(ISTEXT(B339),(HYPERLINK(SUBSTITUTE(HLINK(B339),\".aspx\",\"\")&IF(D$1=2013,\"(v=ocs.15).aspx\",\"(v=ocs.14).aspx\"),B339)),\"\")","v":"New-CsReportingConfiguration"},"Creates a new collection of reporting configuration settings at the service scope. Reporting configuration settings are used to specify the URL used to access Lync Server 2013 Monitoring Reports. This cmdlet was introduced in Lync Server 2013.","yes","no","no","no","no","no","yes","no","no","no","Get-CsAdminRole | ? {$_.Cmdlets –match \"New-CsReportingConfiguration\"}"]
["New-CsRgsAgentGroup","New-CsRgsAgentGroup",{"$f":"IF(ISTEXT(A340),(HYPERLINK(SUBSTITUTE(HLINK(A340),\".aspx\",\"\")&IF(C$1=2013,\"(v=ocs.15).aspx\",\"(v=ocs.14).aspx\"),A340)),\"\")","v":"New-CsRgsAgentGroup"},{"$f":"IF(ISTEXT(B340),(HYPERLINK(SUBSTITUTE(HLINK(B340),\".aspx\",\"\")&IF(D$1=2013,\"(v=ocs.15).aspx\",\"(v=ocs.14).aspx\"),B340)),\"\")","v":"New-CsRgsAgentGroup"},"Creates a new Response Group agent group. An agent group is a collection of agents assigned to a Response Group queue. Agents are the users assigned to answer calls directed to a particular queue.","yes","no","no","no","no","yes","yes","no","no","yes","Get-CsAdminRole | ? {$_.Cmdlets –match \"New-CsRgsAgentGroup\"}"]
["New-CsRgsAnswer","New-CsRgsAnswer",{"$f":"IF(ISTEXT(A341),(HYPERLINK(SUBSTITUTE(HLINK(A341),\".aspx\",\"\")&IF(C$1=2013,\"(v=ocs.15).aspx\",\"(v=ocs.14).aspx\"),A341)),\"\")","v":"New-CsRgsAnswer"},{"$f":"IF(ISTEXT(B341),(HYPERLINK(SUBSTITUTE(HLINK(B341),\".aspx\",\"\")&IF(D$1=2013,\"(v=ocs.15).aspx\",\"(v=ocs.14).aspx\"),B341)),\"\")","v":"New-CsRgsAnswer"},"Creates a new Response Group answer. Response Group answers are used to associate a caller response with the appropriate action.","yes","no","no","no","no","yes","yes","no","no","yes","Get-CsAdminRole | ? {$_.Cmdlets –match \"New-CsRgsAnswer\"}"]
["New-CsRgsCallAction","New-CsRgsCallAction",{"$f":"IF(ISTEXT(A342),(HYPERLINK(SUBSTITUTE(HLINK(A342),\".aspx\",\"\")&IF(C$1=2013,\"(v=ocs.15).aspx\",\"(v=ocs.14).aspx\"),A342)),\"\")","v":"New-CsRgsCallAction"},{"$f":"IF(ISTEXT(B342),(HYPERLINK(SUBSTITUTE(HLINK(B342),\".aspx\",\"\")&IF(D$1=2013,\"(v=ocs.15).aspx\",\"(v=ocs.14).aspx\"),B342)),\"\")","v":"New-CsRgsCallAction"},"Creates a new Response Group call action. The Response Group application uses call actions to determine what the system does when a call is received. For example, a call action might specify that a call be transferred to another queue; that a specific Response Group question be asked; or that the call be terminated.","yes","no","no","no","no","yes","yes","no","no","yes","Get-CsAdminRole | ? {$_.Cmdlets –match \"New-CsRgsCallAction\"}"]
["New-CsRgsHoliday","New-CsRgsHoliday",{"$f":"IF(ISTEXT(A343),(HYPERLINK(SUBSTITUTE(HLINK(A343),\".aspx\",\"\")&IF(C$1=2013,\"(v=ocs.15).aspx\",\"(v=ocs.14).aspx\"),A343)),\"\")","v":"New-CsRgsHoliday"},{"$f":"IF(ISTEXT(B343),(HYPERLINK(SUBSTITUTE(HLINK(B343),\".aspx\",\"\")&IF(D$1=2013,\"(v=ocs.15).aspx\",\"(v=ocs.14).aspx\"),B343)),\"\")","v":"New-CsRgsHoliday"},"Creates a new Response Group holiday. In the Response Group application, a holiday represents a day when the agents assigned to a queue, who would typically be working that day, will not be working and will not be available to answer calls. For example, if United States (U.S.)-based workers are given Thanksgiving Day off, then a holiday would be configured for November 24, 2011.","yes","no","no","no","no","yes","yes","no","no","yes","Get-CsAdminRole | ? {$_.Cmdlets –match \"New-CsRgsHoliday\"}"]
["New-CsRgsHolidaySet","New-CsRgsHolidaySet",{"$f":"IF(ISTEXT(A344),(HYPERLINK(SUBSTITUTE(HLINK(A344),\".aspx\",\"\")&IF(C$1=2013,\"(v=ocs.15).aspx\",\"(v=ocs.14).aspx\"),A344)),\"\")","v":"New-CsRgsHolidaySet"},{"$f":"IF(ISTEXT(B344),(HYPERLINK(SUBSTITUTE(HLINK(B344),\".aspx\",\"\")&IF(D$1=2013,\"(v=ocs.15).aspx\",\"(v=ocs.14).aspx\"),B344)),\"\")","v":"New-CsRgsHolidaySet"},"Creates a new Response Group holiday set. A Response Group holiday set is a collection of holidays. For example, you might have one holiday set for a United States (U.S.)-based queue (a set which might include a holiday for the Fourth of July) and a different set for a queue based in France. The latter queue might define a holiday for Bastille Day but not for the Fourth of July.","yes","no","no","no","no","yes","yes","no","no","yes","Get-CsAdminRole | ? {$_.Cmdlets –match \"New-CsRgsHolidaySet\"}"]
["New-CsRgsHoursOfBusiness","New-CsRgsHoursOfBusiness",{"$f":"IF(ISTEXT(A345),(HYPERLINK(SUBSTITUTE(HLINK(A345),\".aspx\",\"\")&IF(C$1=2013,\"(v=ocs.15).aspx\",\"(v=ocs.14).aspx\"),A345)),\"\")","v":"New-CsRgsHoursOfBusiness"},{"$f":"IF(ISTEXT(B345),(HYPERLINK(SUBSTITUTE(HLINK(B345),\".aspx\",\"\")&IF(D$1=2013,\"(v=ocs.15).aspx\",\"(v=ocs.14).aspx\"),B345)),\"\")","v":"New-CsRgsHoursOfBusiness"},"Creates a new set of Response Group application business hours. Business hour sets are used to indicate the days of the week and the times of day when Response Group agents are typically available to answer phone calls.","yes","no","no","no","no","yes","yes","no","no","yes","Get-CsAdminRole | ? {$_.Cmdlets –match \"New-CsRgsHoursOfBusiness\"}"]
["New-CsRgsPrompt","New-CsRgsPrompt",{"$f":"IF(ISTEXT(A346),(HYPERLINK(SUBSTITUTE(HLINK(A346),\".aspx\",\"\")&IF(C$1=2013,\"(v=ocs.15).aspx\",\"(v=ocs.14).aspx\"),A346)),\"\")","v":"New-CsRgsPrompt"},{"$f":"IF(ISTEXT(B346),(HYPERLINK(SUBSTITUTE(HLINK(B346),\".aspx\",\"\")&IF(D$1=2013,\"(v=ocs.15).aspx\",\"(v=ocs.14).aspx\"),B346)),\"\")","v":"New-CsRgsPrompt"},"Creates a new workflow prompt for the Response Group application. A workflow prompt is either an audio file that is played or text that is read aloud in order to supply callers with additional information.","yes","no","no","no","no","yes","yes","no","no","yes","Get-CsAdminRole | ? {$_.Cmdlets –match \"New-CsRgsPrompt\"}"]
["New-CsRgsQuestion","New-CsRgsQuestion",{"$f":"IF(ISTEXT(A347),(HYPERLINK(SUBSTITUTE(HLINK(A347),\".aspx\",\"\")&IF(C$1=2013,\"(v=ocs.15).aspx\",\"(v=ocs.14).aspx\"),A347)),\"\")","v":"New-CsRgsQuestion"},{"$f":"IF(ISTEXT(B347),(HYPERLINK(SUBSTITUTE(HLINK(B347),\".aspx\",\"\")&IF(D$1=2013,\"(v=ocs.15).aspx\",\"(v=ocs.14).aspx\"),B347)),\"\")","v":"New-CsRgsQuestion"},"Creates a new Response Group question. The Response Group application uses questions to provide callers with choices, and then takes action based on those choices.","yes","no","no","no","no","yes","yes","no","no","yes","Get-CsAdminRole | ? {$_.Cmdlets –match \"New-CsRgsQuestion\"}"]
["New-CsRgsQueue","New-CsRgsQueue",{"$f":"IF(ISTEXT(A348),(HYPERLINK(SUBSTITUTE(HLINK(A348),\".aspx\",\"\")&IF(C$1=2013,\"(v=ocs.15).aspx\",\"(v=ocs.14).aspx\"),A348)),\"\")","v":"New-CsRgsQueue"},{"$f":"IF(ISTEXT(B348),(HYPERLINK(SUBSTITUTE(HLINK(B348),\".aspx\",\"\")&IF(D$1=2013,\"(v=ocs.15).aspx\",\"(v=ocs.14).aspx\"),B348)),\"\")","v":"New-CsRgsQueue"},"Creates a new Response Group queue. With the Response Group application, phone calls are put in a queue and callers are placed on hold until a Response Group agent is available to answer that call.","yes","no","no","no","no","yes","yes","no","no","yes","Get-CsAdminRole | ? {$_.Cmdlets –match \"New-CsRgsQueue\"}"]
["New-CsRgsTimeRange","New-CsRgsTimeRange",{"$f":"IF(ISTEXT(A349),(HYPERLINK(SUBSTITUTE(HLINK(A349),\".aspx\",\"\")&IF(C$1=2013,\"(v=ocs.15).aspx\",\"(v=ocs.14).aspx\"),A349)),\"\")","v":"New-CsRgsTimeRange"},{"$f":"IF(ISTEXT(B349),(HYPERLINK(SUBSTITUTE(HLINK(B349),\".aspx\",\"\")&IF(D$1=2013,\"(v=ocs.15).aspx\",\"(v=ocs.14).aspx\"),B349)),\"\")","v":"New-CsRgsTimeRange"},"Creates a new Response Group time range. Time ranges are used by the Response Group application to specify opening and closing times for a business day. For example, if your help desk agents are available only from 12:00 P.M. to 5:00 P.M. on Sundays, then you would create a time range for Sunday that had an opening time of 12:00 P.M. and a closing time of 5:00 P.M.","yes","no","no","no","no","yes","yes","no","no","yes","Get-CsAdminRole | ? {$_.Cmdlets –match \"New-CsRgsTimeRange\"}"]
["New-CsRgsWorkflow","New-CsRgsWorkflow",{"$f":"IF(ISTEXT(A350),(HYPERLINK(SUBSTITUTE(HLINK(A350),\".aspx\",\"\")&IF(C$1=2013,\"(v=ocs.15).aspx\",\"(v=ocs.14).aspx\"),A350)),\"\")","v":"New-CsRgsWorkflow"},{"$f":"IF(ISTEXT(B350),(HYPERLINK(SUBSTITUTE(HLINK(B350),\".aspx\",\"\")&IF(D$1=2013,\"(v=ocs.15).aspx\",\"(v=ocs.14).aspx\"),B350)),\"\")","v":"New-CsRgsWorkflow"},"Creates a new Response Group workflow. Workflows determine the actions that are taken when the Response Group application receives a phone call.","yes","no","no","no","no","yes","yes","no","no","yes","Get-CsAdminRole | ? {$_.Cmdlets –match \"New-CsRgsWorkflow\"}"]
["New-CsRoutingConfiguration","New-CsRoutingConfiguration",{"$f":"IF(ISTEXT(A351),(HYPERLINK(SUBSTITUTE(HLINK(A351),\".aspx\",\"\")&IF(C$1=2013,\"(v=ocs.15).aspx\",\"(v=ocs.14).aspx\"),A351)),\"\")","v":"New-CsRoutingConfiguration"},{"$f":"IF(ISTEXT(B351),(HYPERLINK(SUBSTITUTE(HLINK(B351),\".aspx\",\"\")&IF(D$1=2013,\"(v=ocs.15).aspx\",\"(v=ocs.14).aspx\"),B351)),\"\")","v":"New-CsRoutingConfiguration"},"This cmdlet can return an object containing the default settings for a routing configuration object.","yes","no","no","no","no","no","yes","no","no","yes","Get-CsAdminRole | ? {$_.Cmdlets –match \"New-CsRoutingConfiguration\"}"]
["New-CsServerApplication","New-CsServerApplication",{"$f":"IF(ISTEXT(A352),(HYPERLINK(SUBSTITUTE(HLINK(A352),\".aspx\",\"\")&IF(C$1=2013,\"(v=ocs.15).aspx\",\"(v=ocs.14).aspx\"),A352)),\"\")","v":"New-CsServerApplication"},{"$f":"IF(ISTEXT(B352),(HYPERLINK(SUBSTITUTE(HLINK(B352),\".aspx\",\"\")&IF(D$1=2013,\"(v=ocs.15).aspx\",\"(v=ocs.14).aspx\"),B352)),\"\")","v":"New-CsServerApplication"},"Creates a new server application. Server applications are applications that are hosted by Microsoft Lync Server 2010.","yes","no","no","no","no","no","yes","no","no","no","Get-CsAdminRole | ? {$_.Cmdlets –match \"New-CsServerApplication\"}"]
["New-CsSimpleUrl","New-CsSimpleUrl",{"$f":"IF(ISTEXT(A353),(HYPERLINK(SUBSTITUTE(HLINK(A353),\".aspx\",\"\")&IF(C$1=2013,\"(v=ocs.15).aspx\",\"(v=ocs.14).aspx\"),A353)),\"\")","v":"New-CsSimpleUrl"},{"$f":"IF(ISTEXT(B353),(HYPERLINK(SUBSTITUTE(HLINK(B353),\".aspx\",\"\")&IF(D$1=2013,\"(v=ocs.15).aspx\",\"(v=ocs.14).aspx\"),B353)),\"\")","v":"New-CsSimpleUrl"},"Creates a new simple URL, which can then be added to a simple URL configuration collection. Simple URLs make it easier for users to join meetings and conferences, as well as making it easier for administrators to log on to the Microsoft Lync Server 2010 Control Panel.","yes","no","no","no","no","no","yes","no","no","no","Get-CsAdminRole | ? {$_.Cmdlets –match \"New-CsSimpleUrl\"}"]
["New-CsSimpleUrlConfiguration","New-CsSimpleUrlConfiguration",{"$f":"IF(ISTEXT(A354),(HYPERLINK(SUBSTITUTE(HLINK(A354),\".aspx\",\"\")&IF(C$1=2013,\"(v=ocs.15).aspx\",\"(v=ocs.14).aspx\"),A354)),\"\")","v":"New-CsSimpleUrlConfiguration"},{"$f":"IF(ISTEXT(B354),(HYPERLINK(SUBSTITUTE(HLINK(B354),\".aspx\",\"\")&IF(D$1=2013,\"(v=ocs.15).aspx\",\"(v=ocs.14).aspx\"),B354)),\"\")","v":"New-CsSimpleUrlConfiguration"},"Creates a new simple URL configuration collection. Simple URLs make it easier for users to join meetings and conferences, as well as making it easier for Administrators to log on to the Microsoft Lync Server 2010 Control Panel.","yes","no","no","no","no","no","yes","no","no","no","Get-CsAdminRole | ? {$_.Cmdlets –match \"New-CsSimpleUrlConfiguration\"}"]
["New-CsSimpleUrlEntry","New-CsSimpleUrlEntry",{"$f":"IF(ISTEXT(A355),(HYPERLINK(SUBSTITUTE(HLINK(A355),\".aspx\",\"\")&IF(C$1=2013,\"(v=ocs.15).aspx\",\"(v=ocs.14).aspx\"),A355)),\"\")","v":"New-CsSimpleUrlEntry"},{"$f":"IF(ISTEXT(B355),(HYPERLINK(SUBSTITUTE(HLINK(B355),\".aspx\",\"\")&IF(D$1=2013,\"(v=ocs.15).aspx\",\"(v=ocs.14).aspx\"),B355)),\"\")","v":"New-CsSimpleUrlEntry"},"Creates a new simple URL entry, an element needed when creating a simple URL. Simple URLs make it easier for users to join meetings and conferences, as well as making it easier for Administrators to log on to the Microsoft Lync Server 2010 Control Panel.","yes","no","no","no","no","no","yes","no","no","no","Get-CsAdminRole | ? {$_.Cmdlets –match \"New-CsSimpleUrlEntry\"}"]
["New-CsSipDomain","New-CsSipDomain",{"$f":"IF(ISTEXT(A356),(HYPERLINK(SUBSTITUTE(HLINK(A356),\".aspx\",\"\")&IF(C$1=2013,\"(v=ocs.15).aspx\",\"(v=ocs.14).aspx\"),A356)),\"\")","v":"New-CsSipDomain"},{"$f":"IF(ISTEXT(B356),(HYPERLINK(SUBSTITUTE(HLINK(B356),\".aspx\",\"\")&IF(D$1=2013,\"(v=ocs.15).aspx\",\"(v=ocs.14).aspx\"),B356)),\"\")","v":"New-CsSipDomain"},"Creates a new SIP domain for use in your organization. SIP domains are domains authorized to send and receive SIP traffic, and are used when assigning SIP addresses to users.","yes","no","no","no","no","no","yes","no","no","no","Get-CsAdminRole | ? {$_.Cmdlets –match \"New-CsSipDomain\"}"]
["New-CsSipProxyCustom","New-CsSipProxyCustom",{"$f":"IF(ISTEXT(A357),(HYPERLINK(SUBSTITUTE(HLINK(A357),\".aspx\",\"\")&IF(C$1=2013,\"(v=ocs.15).aspx\",\"(v=ocs.14).aspx\"),A357)),\"\")","v":"New-CsSipProxyCustom"},{"$f":"IF(ISTEXT(B357),(HYPERLINK(SUBSTITUTE(HLINK(B357),\".aspx\",\"\")&IF(D$1=2013,\"(v=ocs.15).aspx\",\"(v=ocs.14).aspx\"),B357)),\"\")","v":"New-CsSipProxyCustom"},"Used to assign a custom realm (SIP Communications Service) to a collection of proxy configuration settings. Realms (also known as protection domains) are used to authenticate user credentials during logon.","yes","no","no","no","no","no","yes","no","no","no","Get-CsAdminRole | ? {$_.Cmdlets –match \"New-CsSipProxyCustom\"}"]
["New-CsSipProxyRealm","New-CsSipProxyRealm",{"$f":"IF(ISTEXT(A358),(HYPERLINK(SUBSTITUTE(HLINK(A358),\".aspx\",\"\")&IF(C$1=2013,\"(v=ocs.15).aspx\",\"(v=ocs.14).aspx\"),A358)),\"\")","v":"New-CsSipProxyRealm"},{"$f":"IF(ISTEXT(B358),(HYPERLINK(SUBSTITUTE(HLINK(B358),\".aspx\",\"\")&IF(D$1=2013,\"(v=ocs.15).aspx\",\"(v=ocs.14).aspx\"),B358)),\"\")","v":"New-CsSipProxyRealm"},"Used to assign the default realm (SIP Communications Service) to a collection of proxy configuration settings. Realms (also known as protection domains) are used to authenticate user credentials during logon.","yes","no","no","no","no","no","yes","no","no","no","Get-CsAdminRole | ? {$_.Cmdlets –match \"New-CsSipProxyRealm\"}"]
["New-CsSipProxyTCP","New-CsSipProxyTCP",{"$f":"IF(ISTEXT(A359),(HYPERLINK(SUBSTITUTE(HLINK(A359),\".aspx\",\"\")&IF(C$1=2013,\"(v=ocs.15).aspx\",\"(v=ocs.14).aspx\"),A359)),\"\")","v":"New-CsSipProxyTCP"},{"$f":"IF(ISTEXT(B359),(HYPERLINK(SUBSTITUTE(HLINK(B359),\".aspx\",\"\")&IF(D$1=2013,\"(v=ocs.15).aspx\",\"(v=ocs.14).aspx\"),B359)),\"\")","v":"New-CsSipProxyTCP"},"Creates a new SipProxy.TCP object, which can then be used to configure a static route to use Transmission Control Protocol (TCP) as its transport protocol.","yes","no","no","no","no","no","yes","no","no","no","Get-CsAdminRole | ? {$_.Cmdlets –match \"New-CsSipProxyTCP\"}"]
["New-CsSipProxyTLS","New-CsSipProxyTLS",{"$f":"IF(ISTEXT(A360),(HYPERLINK(SUBSTITUTE(HLINK(A360),\".aspx\",\"\")&IF(C$1=2013,\"(v=ocs.15).aspx\",\"(v=ocs.14).aspx\"),A360)),\"\")","v":"New-CsSipProxyTLS"},{"$f":"IF(ISTEXT(B360),(HYPERLINK(SUBSTITUTE(HLINK(B360),\".aspx\",\"\")&IF(D$1=2013,\"(v=ocs.15).aspx\",\"(v=ocs.14).aspx\"),B360)),\"\")","v":"New-CsSipProxyTLS"},"Creates a new SipProxy.TLS object, which can then be used to configure a static route to use Transport Layer Security (TLS) as its transport protocol.","yes","no","no","no","no","no","yes","no","no","no","Get-CsAdminRole | ? {$_.Cmdlets –match \"New-CsSipProxyTLS\"}"]
["New-CsSipProxyTransport","New-CsSipProxyTransport",{"$f":"IF(ISTEXT(A361),(HYPERLINK(SUBSTITUTE(HLINK(A361),\".aspx\",\"\")&IF(C$1=2013,\"(v=ocs.15).aspx\",\"(v=ocs.14).aspx\"),A361)),\"\")","v":"New-CsSipProxyTransport"},{"$f":"IF(ISTEXT(B361),(HYPERLINK(SUBSTITUTE(HLINK(B361),\".aspx\",\"\")&IF(D$1=2013,\"(v=ocs.15).aspx\",\"(v=ocs.14).aspx\"),B361)),\"\")","v":"New-CsSipProxyTransport"},"Specifies the transmission protocol to be used in a static route. Microsoft Lync Server 2010 enables you to choose either Transmission Control Protocol (TCP) or Transport Layer Security (TLS) as the transmission protocol for a route.","yes","no","no","no","no","no","yes","no","no","no","Get-CsAdminRole | ? {$_.Cmdlets –match \"New-CsSipProxyTransport\"}"]
["New-CsSipProxyUseDefault","New-CsSipProxyUseDefault",{"$f":"IF(ISTEXT(A362),(HYPERLINK(SUBSTITUTE(HLINK(A362),\".aspx\",\"\")&IF(C$1=2013,\"(v=ocs.15).aspx\",\"(v=ocs.14).aspx\"),A362)),\"\")","v":"New-CsSipProxyUseDefault"},{"$f":"IF(ISTEXT(B362),(HYPERLINK(SUBSTITUTE(HLINK(B362),\".aspx\",\"\")&IF(D$1=2013,\"(v=ocs.15).aspx\",\"(v=ocs.14).aspx\"),B362)),\"\")","v":"New-CsSipProxyUseDefault"},"Used to assign the default realm (SIP Communications Service) to a collection of proxy configuration settings. Realms (also known as protection domains) are used to authenticate user credentials during logon.","yes","no","no","no","no","no","yes","no","no","no","Get-CsAdminRole | ? {$_.Cmdlets –match \"New-CsSipProxyUseDefault\"}"]
["New-CsSipProxyUseDefaultCert","New-CsSipProxyUseDefaultCert",{"$f":"IF(ISTEXT(A363),(HYPERLINK(SUBSTITUTE(HLINK(A363),\".aspx\",\"\")&IF(C$1=2013,\"(v=ocs.15).aspx\",\"(v=ocs.14).aspx\"),A363)),\"\")","v":"New-CsSipProxyUseDefaultCert"},{"$f":"IF(ISTEXT(B363),(HYPERLINK(SUBSTITUTE(HLINK(B363),\".aspx\",\"\")&IF(D$1=2013,\"(v=ocs.15).aspx\",\"(v=ocs.14).aspx\"),B363)),\"\")","v":"New-CsSipProxyUseDefaultCert"},"Creates an object reference to the default certificate used by Microsoft Lync Server 2010. This object reference can then be used to configure a static route to use Transport Layer Security (TLS) as its transport protocol.","yes","no","no","no","no","no","yes","no","no","no","Get-CsAdminRole | ? {$_.Cmdlets –match \"New-CsSipProxyUseDefaultCert\"}"]
["New-CsSipResponseCodeTranslationRule","New-CsSipResponseCodeTranslationRule",{"$f":"IF(ISTEXT(A364),(HYPERLINK(SUBSTITUTE(HLINK(A364),\".aspx\",\"\")&IF(C$1=2013,\"(v=ocs.15).aspx\",\"(v=ocs.14).aspx\"),A364)),\"\")","v":"New-CsSipResponseCodeTranslationRule"},{"$f":"IF(ISTEXT(B364),(HYPERLINK(SUBSTITUTE(HLINK(B364),\".aspx\",\"\")&IF(D$1=2013,\"(v=ocs.15).aspx\",\"(v=ocs.14).aspx\"),B364)),\"\")","v":"New-CsSipResponseCodeTranslationRule"},"Creates a new SIP response code translation rule. These rules enable administrators to map SIP response codes with values between 400 and 699 to the values used by Microsoft Lync Server 2010.","yes","no","no","no","no","no","yes","no","no","yes","Get-CsAdminRole | ? {$_.Cmdlets –match \"New-CsSipResponseCodeTranslationRule\"}"]
["New-CsStaticRoute","New-CsStaticRoute",{"$f":"IF(ISTEXT(A365),(HYPERLINK(SUBSTITUTE(HLINK(A365),\".aspx\",\"\")&IF(C$1=2013,\"(v=ocs.15).aspx\",\"(v=ocs.14).aspx\"),A365)),\"\")","v":"New-CsStaticRoute"},{"$f":"IF(ISTEXT(B365),(HYPERLINK(SUBSTITUTE(HLINK(B365),\".aspx\",\"\")&IF(D$1=2013,\"(v=ocs.15).aspx\",\"(v=ocs.14).aspx\"),B365)),\"\")","v":"New-CsStaticRoute"},"Creates a new static phone route.","yes","no","no","no","no","no","yes","no","no","no","Get-CsAdminRole | ? {$_.Cmdlets –match \"New-CsStaticRoute\"}"]
["New-CsStaticRoutingConfiguration","New-CsStaticRoutingConfiguration",{"$f":"IF(ISTEXT(A366),(HYPERLINK(SUBSTITUTE(HLINK(A366),\".aspx\",\"\")&IF(C$1=2013,\"(v=ocs.15).aspx\",\"(v=ocs.14).aspx\"),A366)),\"\")","v":"New-CsStaticRoutingConfiguration"},{"$f":"IF(ISTEXT(B366),(HYPERLINK(SUBSTITUTE(HLINK(B366),\".aspx\",\"\")&IF(D$1=2013,\"(v=ocs.15).aspx\",\"(v=ocs.14).aspx\"),B366)),\"\")","v":"New-CsStaticRoutingConfiguration"},"Creates a new collection of static routing configuration settings.","yes","no","no","no","no","no","yes","no","no","no","Get-CsAdminRole | ? {$_.Cmdlets –match \"New-CsStaticRoutingConfiguration\"}"]
["New-CsTestDevice","New-CsTestDevice",{"$f":"IF(ISTEXT(A367),(HYPERLINK(SUBSTITUTE(HLINK(A367),\".aspx\",\"\")&IF(C$1=2013,\"(v=ocs.15).aspx\",\"(v=ocs.14).aspx\"),A367)),\"\")","v":"New-CsTestDevice"},{"$f":"IF(ISTEXT(B367),(HYPERLINK(SUBSTITUTE(HLINK(B367),\".aspx\",\"\")&IF(D$1=2013,\"(v=ocs.15).aspx\",\"(v=ocs.14).aspx\"),B367)),\"\")","v":"New-CsTestDevice"},"Creates a new device update management test device. Test devices provide a way for administrators to test firmware updates before those updates are distributed to all the devices in an organization.","yes","no","no","no","no","no","yes","no","no","yes","Get-CsAdminRole | ? {$_.Cmdlets –match \"New-CsTestDevice\"}"]
["New-CsTrunkConfiguration","New-CsTrunkConfiguration",{"$f":"IF(ISTEXT(A368),(HYPERLINK(SUBSTITUTE(HLINK(A368),\".aspx\",\"\")&IF(C$1=2013,\"(v=ocs.15).aspx\",\"(v=ocs.14).aspx\"),A368)),\"\")","v":"New-CsTrunkConfiguration"},{"$f":"IF(ISTEXT(B368),(HYPERLINK(SUBSTITUTE(HLINK(B368),\".aspx\",\"\")&IF(D$1=2013,\"(v=ocs.15).aspx\",\"(v=ocs.14).aspx\"),B368)),\"\")","v":"New-CsTrunkConfiguration"},"Creates a new trunk configuration that describes the settings for a trunking peer entity such as a public switched telephone network (PSTN) gateway, IP-public branch exchange (PBX), or Session Border Controller (SBC) at the service provider.","yes","no","no","no","no","no","yes","no","no","yes","Get-CsAdminRole | ? {$_.Cmdlets –match \"New-CsTrunkConfiguration\"}"]
["New-CsTrustedApplication","New-CsTrustedApplication",{"$f":"IF(ISTEXT(A369),(HYPERLINK(SUBSTITUTE(HLINK(A369),\".aspx\",\"\")&IF(C$1=2013,\"(v=ocs.15).aspx\",\"(v=ocs.14).aspx\"),A369)),\"\")","v":"New-CsTrustedApplication"},{"$f":"IF(ISTEXT(B369),(HYPERLINK(SUBSTITUTE(HLINK(B369),\".aspx\",\"\")&IF(D$1=2013,\"(v=ocs.15).aspx\",\"(v=ocs.14).aspx\"),B369)),\"\")","v":"New-CsTrustedApplication"},"Adds a trusted application to a pool.","yes","no","no","no","no","no","yes","no","no","no","Get-CsAdminRole | ? {$_.Cmdlets –match \"New-CsTrustedApplication\"}"]
["New-CsTrustedApplicationComputer","New-CsTrustedApplicationComputer",{"$f":"IF(ISTEXT(A370),(HYPERLINK(SUBSTITUTE(HLINK(A370),\".aspx\",\"\")&IF(C$1=2013,\"(v=ocs.15).aspx\",\"(v=ocs.14).aspx\"),A370)),\"\")","v":"New-CsTrustedApplicationComputer"},{"$f":"IF(ISTEXT(B370),(HYPERLINK(SUBSTITUTE(HLINK(B370),\".aspx\",\"\")&IF(D$1=2013,\"(v=ocs.15).aspx\",\"(v=ocs.14).aspx\"),B370)),\"\")","v":"New-CsTrustedApplicationComputer"},"Adds a computer that hosts trusted applications to an existing pool.","yes","no","no","no","no","no","yes","no","no","no","Get-CsAdminRole | ? {$_.Cmdlets –match \"New-CsTrustedApplicationComputer\"}"]
["New-CsTrustedApplicationEndpoint","New-CsTrustedApplicationEndpoint",{"$f":"IF(ISTEXT(A371),(HYPERLINK(SUBSTITUTE(HLINK(A371),\".aspx\",\"\")&IF(C$1=2013,\"(v=ocs.15).aspx\",\"(v=ocs.14).aspx\"),A371)),\"\")","v":"New-CsTrustedApplicationEndpoint"},{"$f":"IF(ISTEXT(B371),(HYPERLINK(SUBSTITUTE(HLINK(B371),\".aspx\",\"\")&IF(D$1=2013,\"(v=ocs.15).aspx\",\"(v=ocs.14).aspx\"),B371)),\"\")","v":"New-CsTrustedApplicationEndpoint"},"Creates a new endpoint contact for a trusted application.","yes","no","no","no","no","no","yes","no","no","no","Get-CsAdminRole | ? {$_.Cmdlets –match \"New-CsTrustedApplicationEndpoint\"}"]
["New-CsTrustedApplicationPool","New-CsTrustedApplicationPool",{"$f":"IF(ISTEXT(A372),(HYPERLINK(SUBSTITUTE(HLINK(A372),\".aspx\",\"\")&IF(C$1=2013,\"(v=ocs.15).aspx\",\"(v=ocs.14).aspx\"),A372)),\"\")","v":"New-CsTrustedApplicationPool"},{"$f":"IF(ISTEXT(B372),(HYPERLINK(SUBSTITUTE(HLINK(B372),\".aspx\",\"\")&IF(D$1=2013,\"(v=ocs.15).aspx\",\"(v=ocs.14).aspx\"),B372)),\"\")","v":"New-CsTrustedApplicationPool"},"Creates a new pool that will contain the computers that host trusted applications.","yes","no","no","no","no","no","yes","no","no","no","Get-CsAdminRole | ? {$_.Cmdlets –match \"New-CsTrustedApplicationPool\"}"]
["New-CsUCPhoneConfiguration","New-CsUCPhoneConfiguration",{"$f":"IF(ISTEXT(A373),(HYPERLINK(SUBSTITUTE(HLINK(A373),\".aspx\",\"\")&IF(C$1=2013,\"(v=ocs.15).aspx\",\"(v=ocs.14).aspx\"),A373)),\"\")","v":"New-CsUCPhoneConfiguration"},{"$f":"IF(ISTEXT(B373),(HYPERLINK(SUBSTITUTE(HLINK(B373),\".aspx\",\"\")&IF(D$1=2013,\"(v=ocs.15).aspx\",\"(v=ocs.14).aspx\"),B373)),\"\")","v":"New-CsUCPhoneConfiguration"},"Creates a new collection of settings used to manage Microsoft Lync 2010 Phone Edition. These settings enable you to configure such things as the required security mode, and to specify whether or not the phone should automatically be locked after a specified period of inactivity.","yes","no","no","no","no","no","yes","no","no","yes","Get-CsAdminRole | ? {$_.Cmdlets –match \"New-CsUCPhoneConfiguration\"}"]
["New-CsUnassignedNumber","New-CsUnassignedNumber",{"$f":"IF(ISTEXT(A374),(HYPERLINK(SUBSTITUTE(HLINK(A374),\".aspx\",\"\")&IF(C$1=2013,\"(v=ocs.15).aspx\",\"(v=ocs.14).aspx\"),A374)),\"\")","v":"New-CsUnassignedNumber"},{"$f":"IF(ISTEXT(B374),(HYPERLINK(SUBSTITUTE(HLINK(B374),\".aspx\",\"\")&IF(D$1=2013,\"(v=ocs.15).aspx\",\"(v=ocs.14).aspx\"),B374)),\"\")","v":"New-CsUnassignedNumber"},"Creates a new range of unassigned numbers and the routing rules that apply to those numbers. Running this cmdlet will add an entry to the unassigned number routing table.","yes","no","no","no","no","no","yes","no","no","yes","Get-CsAdminRole | ? {$_.Cmdlets –match \"New-CsUnassignedNumber\"}"]
["New-CsUserReplicatorConfiguration","New-CsUserReplicatorConfiguration",{"$f":"IF(ISTEXT(A375),(HYPERLINK(SUBSTITUTE(HLINK(A375),\".aspx\",\"\")&IF(C$1=2013,\"(v=ocs.15).aspx\",\"(v=ocs.14).aspx\"),A375)),\"\")","v":"New-CsUserReplicatorConfiguration"},{"$f":"IF(ISTEXT(B375),(HYPERLINK(SUBSTITUTE(HLINK(B375),\".aspx\",\"\")&IF(D$1=2013,\"(v=ocs.15).aspx\",\"(v=ocs.14).aspx\"),B375)),\"\")","v":"New-CsUserReplicatorConfiguration"},"Creates a new collection of User Replicator configuration settings. The User Replicator periodically retrieves up-to-date user account information from Active Directory and then synchronizes the new information with the current user data stored by Microsoft Lync Server 2010. This cmdlet is designed for use with Microsoft Lync Online 2010 and will not work with the on-premises version of Lync Server 2010.","yes","no","no","no","no","no","yes","no","no","no","Get-CsAdminRole | ? {$_.Cmdlets –match \"New-CsUserReplicatorConfiguration\"}"]
["New-CsUserServicesConfiguration","New-CsUserServicesConfiguration",{"$f":"IF(ISTEXT(A376),(HYPERLINK(SUBSTITUTE(HLINK(A376),\".aspx\",\"\")&IF(C$1=2013,\"(v=ocs.15).aspx\",\"(v=ocs.14).aspx\"),A376)),\"\")","v":"New-CsUserServicesConfiguration"},{"$f":"IF(ISTEXT(B376),(HYPERLINK(SUBSTITUTE(HLINK(B376),\".aspx\",\"\")&IF(D$1=2013,\"(v=ocs.15).aspx\",\"(v=ocs.14).aspx\"),B376)),\"\")","v":"New-CsUserServicesConfiguration"},"Creates a new collection of User Services configuration settings. The User Services service is used to help maintain presence information and manage conferencing.","yes","no","no","no","no","no","yes","no","no","no","Get-CsAdminRole | ? {$_.Cmdlets –match \"New-CsUserServicesConfiguration\"}"]
[null,"New-CsUserServicesPolicy",{"$f":"IF(ISTEXT(A377),(HYPERLINK(SUBSTITUTE(HLINK(A377),\".aspx\",\"\")&IF(C$1=2013,\"(v=ocs.15).aspx\",\"(v=ocs.14).aspx\"),A377)),\"\")","v":""},{"$f":"IF(ISTEXT(B377),(HYPERLINK(SUBSTITUTE(HLINK(B377),\".aspx\",\"\")&IF(D$1=2013,\"(v=ocs.15).aspx\",\"(v=ocs.14).aspx\"),B377)),\"\")","v":"New-CsUserServicesPolicy"},"Creates a new User Services policy. User Services policies determine whether or not a user's contacts are stored in Lync Server 2013 or in the Unified Contact Store. The Unified Contact Store provides a way for users to maintain a single set of contacts that can be accessed using Lync 2013, Microsoft Outlook, and/or Microsoft Outlook Web Access. This cmdlet was introduced in Lync Server 2013.","yes","no","no","no","no","no","yes","no","no","no","Get-CsAdminRole | ? {$_.Cmdlets –match \"New-CsUserServicesPolicy\"}"]
["New-CsVoicemailReroutingConfiguration","New-CsVoicemailReroutingConfiguration",{"$f":"IF(ISTEXT(A378),(HYPERLINK(SUBSTITUTE(HLINK(A378),\".aspx\",\"\")&IF(C$1=2013,\"(v=ocs.15).aspx\",\"(v=ocs.14).aspx\"),A378)),\"\")","v":"New-CsVoicemailReroutingConfiguration"},{"$f":"IF(ISTEXT(B378),(HYPERLINK(SUBSTITUTE(HLINK(B378),\".aspx\",\"\")&IF(D$1=2013,\"(v=ocs.15).aspx\",\"(v=ocs.14).aspx\"),B378)),\"\")","v":"New-CsVoicemailReroutingConfiguration"},"Creates settings that, when enabled, provide phone numbers that Microsoft Lync Server 2010 routes to over public switched telephone network (PSTN) if IP connectivity from Lync Server 2010 in the branch site to the Exchange Unified Messaging (UM) Server located in the data center is not available.","yes","no","no","no","no","no","yes","no","no","yes","Get-CsAdminRole | ? {$_.Cmdlets –match \"New-CsVoicemailReroutingConfiguration\"}"]
["New-CsVoiceNormalizationRule","New-CsVoiceNormalizationRule",{"$f":"IF(ISTEXT(A379),(HYPERLINK(SUBSTITUTE(HLINK(A379),\".aspx\",\"\")&IF(C$1=2013,\"(v=ocs.15).aspx\",\"(v=ocs.14).aspx\"),A379)),\"\")","v":"New-CsVoiceNormalizationRule"},{"$f":"IF(ISTEXT(B379),(HYPERLINK(SUBSTITUTE(HLINK(B379),\".aspx\",\"\")&IF(D$1=2013,\"(v=ocs.15).aspx\",\"(v=ocs.14).aspx\"),B379)),\"\")","v":"New-CsVoiceNormalizationRule"},"Creates a new voice normalization rule. Voice normalization rules are used to convert a telephone dialing requirement (for example, dialing 9 to access an outside line) to the E.164 phone number format used by Microsoft Lync Server 2010.","yes","no","no","no","no","no","yes","no","no","yes","Get-CsAdminRole | ? {$_.Cmdlets –match \"New-CsVoiceNormalizationRule\"}"]
["New-CsVoicePolicy","New-CsVoicePolicy",{"$f":"IF(ISTEXT(A380),(HYPERLINK(SUBSTITUTE(HLINK(A380),\".aspx\",\"\")&IF(C$1=2013,\"(v=ocs.15).aspx\",\"(v=ocs.14).aspx\"),A380)),\"\")","v":"New-CsVoicePolicy"},{"$f":"IF(ISTEXT(B380),(HYPERLINK(SUBSTITUTE(HLINK(B380),\".aspx\",\"\")&IF(D$1=2013,\"(v=ocs.15).aspx\",\"(v=ocs.14).aspx\"),B380)),\"\")","v":"New-CsVoicePolicy"},"Creates a new voice policy.","yes","no","no","no","no","no","yes","no","no","yes","Get-CsAdminRole | ? {$_.Cmdlets –match \"New-CsVoicePolicy\"}"]
["New-CsVoiceRegex","New-CsVoiceRegex",{"$f":"IF(ISTEXT(A381),(HYPERLINK(SUBSTITUTE(HLINK(A381),\".aspx\",\"\")&IF(C$1=2013,\"(v=ocs.15).aspx\",\"(v=ocs.14).aspx\"),A381)),\"\")","v":"New-CsVoiceRegex"},{"$f":"IF(ISTEXT(B381),(HYPERLINK(SUBSTITUTE(HLINK(B381),\".aspx\",\"\")&IF(D$1=2013,\"(v=ocs.15).aspx\",\"(v=ocs.14).aspx\"),B381)),\"\")","v":"New-CsVoiceRegex"},"Creates a regular expression pattern and translation for translating phone numbers to different formats.","yes","no","no","no","no","no","yes","no","no","yes","Get-CsAdminRole | ? {$_.Cmdlets –match \"New-CsVoiceRegex\"}"]
["New-CsVoiceRoute","New-CsVoiceRoute",{"$f":"IF(ISTEXT(A382),(HYPERLINK(SUBSTITUTE(HLINK(A382),\".aspx\",\"\")&IF(C$1=2013,\"(v=ocs.15).aspx\",\"(v=ocs.14).aspx\"),A382)),\"\")","v":"New-CsVoiceRoute"},{"$f":"IF(ISTEXT(B382),(HYPERLINK(SUBSTITUTE(HLINK(B382),\".aspx\",\"\")&IF(D$1=2013,\"(v=ocs.15).aspx\",\"(v=ocs.14).aspx\"),B382)),\"\")","v":"New-CsVoiceRoute"},"Creates a new voice route. Voice routes contain instructions that tell Microsoft Lync Server 2010 how to route calls from Enterprise Voice users to phone numbers on the public switched telephone network (PSTN) or a private branch exchange (PBX).","yes","no","no","no","no","no","yes","no","no","yes","Get-CsAdminRole | ? {$_.Cmdlets –match \"New-CsVoiceRoute\"}"]
[null,"New-CsVoiceRoutingPolicy",{"$f":"IF(ISTEXT(A383),(HYPERLINK(SUBSTITUTE(HLINK(A383),\".aspx\",\"\")&IF(C$1=2013,\"(v=ocs.15).aspx\",\"(v=ocs.14).aspx\"),A383)),\"\")","v":""},{"$f":"IF(ISTEXT(B383),(HYPERLINK(SUBSTITUTE(HLINK(B383),\".aspx\",\"\")&IF(D$1=2013,\"(v=ocs.15).aspx\",\"(v=ocs.14).aspx\"),B383)),\"\")","v":"New-CsVoiceRoutingPolicy"},"Creates a new voice routing policy. Voice routing policies manage PSTN usages for users of hybrid voice. Hybrid voice enables users homed on Lync Online to take advantage of the Enterprise Voice capabilities available in an on-premises installation of Lync Server 2013. This cmdlet was introduced in Lync Server 2013.","yes","no","no","no","no","no","yes","no","no","yes","Get-CsAdminRole | ? {$_.Cmdlets –match \"New-CsVoiceRoutingPolicy\"}"]
["New-CsVoiceTestConfiguration","New-CsVoiceTestConfiguration",{"$f":"IF(ISTEXT(A384),(HYPERLINK(SUBSTITUTE(HLINK(A384),\".aspx\",\"\")&IF(C$1=2013,\"(v=ocs.15).aspx\",\"(v=ocs.14).aspx\"),A384)),\"\")","v":"New-CsVoiceTestConfiguration"},{"$f":"IF(ISTEXT(B384),(HYPERLINK(SUBSTITUTE(HLINK(B384),\".aspx\",\"\")&IF(D$1=2013,\"(v=ocs.15).aspx\",\"(v=ocs.14).aspx\"),B384)),\"\")","v":"New-CsVoiceTestConfiguration"},"Creates a test scenario you can use to test phone numbers against specified routes and rules.","yes","no","no","no","no","no","yes","no","no","yes","Get-CsAdminRole | ? {$_.Cmdlets –match \"New-CsVoiceTestConfiguration\"}"]
[null,"New-CsWatcherNodeConfiguration",{"$f":"IF(ISTEXT(A385),(HYPERLINK(SUBSTITUTE(HLINK(A385),\".aspx\",\"\")&IF(C$1=2013,\"(v=ocs.15).aspx\",\"(v=ocs.14).aspx\"),A385)),\"\")","v":""},{"$f":"IF(ISTEXT(B385),(HYPERLINK(SUBSTITUTE(HLINK(B385),\".aspx\",\"\")&IF(D$1=2013,\"(v=ocs.15).aspx\",\"(v=ocs.14).aspx\"),B385)),\"\")","v":"New-CsWatcherNodeConfiguration"},"Assigns a new collection of watcher node configuration settings to a pool. Watcher nodes are computers that periodically use Microsoft System Center Operations Manager and Lync Server 2013 synthetic transactions to verify that Lync Server components are working as expected. This cmdlet was introduced in Lync Server 2013.","yes","no","no","no","no","no","yes","no","no","no","Get-CsAdminRole | ? {$_.Cmdlets –match \"New-CsWatcherNodeConfiguration\"}"]
["New-CsWebLink","New-CsWebLink",{"$f":"IF(ISTEXT(A386),(HYPERLINK(SUBSTITUTE(HLINK(A386),\".aspx\",\"\")&IF(C$1=2013,\"(v=ocs.15).aspx\",\"(v=ocs.14).aspx\"),A386)),\"\")","v":"New-CsWebLink"},{"$f":"IF(ISTEXT(B386),(HYPERLINK(SUBSTITUTE(HLINK(B386),\".aspx\",\"\")&IF(D$1=2013,\"(v=ocs.15).aspx\",\"(v=ocs.14).aspx\"),B386)),\"\")","v":"New-CsWebLink"},"Creates a new web link that points to the Autodiscover service. The Autodiscover service provides a way for client applications such as Lync Web App or Lync Mobile to locate key resources such as a user's home pool or the URL for joining a dial-in conference. This cmdlet was introduced in the cumulative update for Lync Server 2010: November 2011.","yes","no","no","no","no","no","yes","no","no","no","Get-CsAdminRole | ? {$_.Cmdlets –match \"New-CsWebLink\"}"]
[null,"New-CsWebOrigin",{"$f":"IF(ISTEXT(A387),(HYPERLINK(SUBSTITUTE(HLINK(A387),\".aspx\",\"\")&IF(C$1=2013,\"(v=ocs.15).aspx\",\"(v=ocs.14).aspx\"),A387)),\"\")","v":""},{"$f":"IF(ISTEXT(B387),(HYPERLINK(SUBSTITUTE(HLINK(B387),\".aspx\",\"\")&IF(D$1=2013,\"(v=ocs.15).aspx\",\"(v=ocs.14).aspx\"),B387)),\"\")","v":"New-CsWebOrigin"},"Creates a new domain object that can be added to the collection of domains allowed to send cross-domain scripting requests to the Lync Server 2013 deployment. This cmdlet was introduced in the Cumulative Updates for Lync Server 2013: February 2013.","yes","no","no","no","no","no","no","no","no","no","Get-CsAdminRole | ? {$_.Cmdlets –match \"New-CsWebOrigin\"}"]
["New-CsWebServiceConfiguration","New-CsWebServiceConfiguration",{"$f":"IF(ISTEXT(A388),(HYPERLINK(SUBSTITUTE(HLINK(A388),\".aspx\",\"\")&IF(C$1=2013,\"(v=ocs.15).aspx\",\"(v=ocs.14).aspx\"),A388)),\"\")","v":"New-CsWebServiceConfiguration"},{"$f":"IF(ISTEXT(B388),(HYPERLINK(SUBSTITUTE(HLINK(B388),\".aspx\",\"\")&IF(D$1=2013,\"(v=ocs.15).aspx\",\"(v=ocs.14).aspx\"),B388)),\"\")","v":"New-CsWebServiceConfiguration"},"Creates a new collection of Web Services configuration settings.","yes","no","no","no","no","no","yes","no","no","no",{"$f":"\"Get-CsAdminRole | ? {$_.Cmdlets –match \"& CHAR(34) &B388& CHAR(34) &\"}\"","v":"Get-CsAdminRole | ? {$_.Cmdlets –match \"New-CsWebServiceConfiguration\"}"}]
["New-CsWebTrustedCACertificate","New-CsWebTrustedCACertificate",{"$f":"IF(ISTEXT(A389),(HYPERLINK(SUBSTITUTE(HLINK(A389),\".aspx\",\"\")&IF(C$1=2013,\"(v=ocs.15).aspx\",\"(v=ocs.14).aspx\"),A389)),\"\")","v":"New-CsWebTrustedCACertificate"},{"$f":"IF(ISTEXT(B389),(HYPERLINK(SUBSTITUTE(HLINK(B389),\".aspx\",\"\")&IF(D$1=2013,\"(v=ocs.15).aspx\",\"(v=ocs.14).aspx\"),B389)),\"\")","v":"New-CsWebTrustedCACertificate"},"Creates a new certificate ID object based on an existing certification authority (CA) certificate.","yes","no","no","no","no","no","yes","no","no","no","Get-CsAdminRole | ? {$_.Cmdlets –match \"New-CsWebTrustedCACertificate\"}"]
[null,"New-CsXmppAllowedPartner",{"$f":"IF(ISTEXT(A390),(HYPERLINK(SUBSTITUTE(HLINK(A390),\".aspx\",\"\")&IF(C$1=2013,\"(v=ocs.15).aspx\",\"(v=ocs.14).aspx\"),A390)),\"\")","v":""},{"$f":"IF(ISTEXT(B390),(HYPERLINK(SUBSTITUTE(HLINK(B390),\".aspx\",\"\")&IF(D$1=2013,\"(v=ocs.15).aspx\",\"(v=ocs.14).aspx\"),B390)),\"\")","v":"New-CsXmppAllowedPartner"},"Creates a new XMPP allowed partner. The extensible Messaging and Presence Protocol (XMPP) is an open-standard communications protocol for exchanging messages using XML. An allowed partner is an IM and presence provider whose users have been authorized to exchange instant messages and presence information with your Lync Server 2013 users. This cmdlet was introduced in Lync Server 2013.","yes","no","no","no","no","no","yes","no","no","no","Get-CsAdminRole | ? {$_.Cmdlets –match \"New-CsXmppAllowedPartner\"}"]
["Publish-CsLisConfiguration","Publish-CsLisConfiguration",{"$f":"IF(ISTEXT(A391),(HYPERLINK(SUBSTITUTE(HLINK(A391),\".aspx\",\"\")&IF(C$1=2013,\"(v=ocs.15).aspx\",\"(v=ocs.14).aspx\"),A391)),\"\")","v":"Publish-CsLisConfiguration"},{"$f":"IF(ISTEXT(B391),(HYPERLINK(SUBSTITUTE(HLINK(B391),\".aspx\",\"\")&IF(D$1=2013,\"(v=ocs.15).aspx\",\"(v=ocs.14).aspx\"),B391)),\"\")","v":"Publish-CsLisConfiguration"},"Publishes the Location Information Server (LIS) configuration to the Central Management store.","yes","no","no","yes","no","no","yes","no","no","yes","Get-CsAdminRole | ? {$_.Cmdlets –match \"Publish-CsLisConfiguration\"}"]
["Publish-CsTopology","Publish-CsTopology",{"$f":"IF(ISTEXT(A392),(HYPERLINK(SUBSTITUTE(HLINK(A392),\".aspx\",\"\")&IF(C$1=2013,\"(v=ocs.15).aspx\",\"(v=ocs.14).aspx\"),A392)),\"\")","v":"Publish-CsTopology"},{"$f":"IF(ISTEXT(B392),(HYPERLINK(SUBSTITUTE(HLINK(B392),\".aspx\",\"\")&IF(D$1=2013,\"(v=ocs.15).aspx\",\"(v=ocs.14).aspx\"),B392)),\"\")","v":"Publish-CsTopology"},"Publishes the Microsoft Lync Server 2010 topology retrieved by using the Get-CsTopology cmdlet.","no","no","no","no","no","no","no","no","no","no","Get-CsAdminRole | ? {$_.Cmdlets –match \"Publish-CsTopology\"}"]
["Remove-CsAddressBookConfiguration","Remove-CsAddressBookConfiguration",{"$f":"IF(ISTEXT(A393),(HYPERLINK(SUBSTITUTE(HLINK(A393),\".aspx\",\"\")&IF(C$1=2013,\"(v=ocs.15).aspx\",\"(v=ocs.14).aspx\"),A393)),\"\")","v":"Remove-CsAddressBookConfiguration"},{"$f":"IF(ISTEXT(B393),(HYPERLINK(SUBSTITUTE(HLINK(B393),\".aspx\",\"\")&IF(D$1=2013,\"(v=ocs.15).aspx\",\"(v=ocs.14).aspx\"),B393)),\"\")","v":"Remove-CsAddressBookConfiguration"},"Removes the specified collection of Address Book configuration settings.","yes","no","no","no","no","no","yes","no","no","no","Get-CsAdminRole | ? {$_.Cmdlets –match \"Remove-CsAddressBookConfiguration\"}"]
["Remove-CsAdminRole","Remove-CsAdminRole",{"$f":"IF(ISTEXT(A394),(HYPERLINK(SUBSTITUTE(HLINK(A394),\".aspx\",\"\")&IF(C$1=2013,\"(v=ocs.15).aspx\",\"(v=ocs.14).aspx\"),A394)),\"\")","v":"Remove-CsAdminRole"},{"$f":"IF(ISTEXT(B394),(HYPERLINK(SUBSTITUTE(HLINK(B394),\".aspx\",\"\")&IF(D$1=2013,\"(v=ocs.15).aspx\",\"(v=ocs.14).aspx\"),B394)),\"\")","v":"Remove-CsAdminRole"},"Removes an existing role-based access control (RBAC) role. RBAC roles are used to specify the management tasks that users are allowed to carry out, and to determine the scope in which users will be allowed to perform these tasks.","yes","no","no","no","no","no","no","no","no","no","Get-CsAdminRole | ? {$_.Cmdlets –match \"Remove-CsAdminRole\"}"]
["Remove-CsAllowedDomain","Remove-CsAllowedDomain",{"$f":"IF(ISTEXT(A395),(HYPERLINK(SUBSTITUTE(HLINK(A395),\".aspx\",\"\")&IF(C$1=2013,\"(v=ocs.15).aspx\",\"(v=ocs.14).aspx\"),A395)),\"\")","v":"Remove-CsAllowedDomain"},{"$f":"IF(ISTEXT(B395),(HYPERLINK(SUBSTITUTE(HLINK(B395),\".aspx\",\"\")&IF(D$1=2013,\"(v=ocs.15).aspx\",\"(v=ocs.14).aspx\"),B395)),\"\")","v":"Remove-CsAllowedDomain"},"Removes a domain from the list of domains approved for federation.","yes","no","no","no","no","no","yes","no","no","no","Get-CsAdminRole | ? {$_.Cmdlets –match \"Remove-CsAllowedDomain\"}"]
["Remove-CsAnalogDevice","Remove-CsAnalogDevice",{"$f":"IF(ISTEXT(A396),(HYPERLINK(SUBSTITUTE(HLINK(A396),\".aspx\",\"\")&IF(C$1=2013,\"(v=ocs.15).aspx\",\"(v=ocs.14).aspx\"),A396)),\"\")","v":"Remove-CsAnalogDevice"},{"$f":"IF(ISTEXT(B396),(HYPERLINK(SUBSTITUTE(HLINK(B396),\".aspx\",\"\")&IF(D$1=2013,\"(v=ocs.15).aspx\",\"(v=ocs.14).aspx\"),B396)),\"\")","v":"Remove-CsAnalogDevice"},"Removes an existing device from the collection of analog devices that can be managed by using Microsoft Lync Server 2010. An analog device is a telephone or other device that is connected to the public switched telephone network (PSTN).","yes","no","no","no","no","no","yes","yes","no","yes",{"$f":"\"Get-CsAdminRole | ? {$_.Cmdlets –match \"& CHAR(34) &B396& CHAR(34) &\"}\"","v":"Get-CsAdminRole | ? {$_.Cmdlets –match \"Remove-CsAnalogDevice\"}"}]
["Remove-CsAnnouncement","Remove-CsAnnouncement",{"$f":"IF(ISTEXT(A397),(HYPERLINK(SUBSTITUTE(HLINK(A397),\".aspx\",\"\")&IF(C$1=2013,\"(v=ocs.15).aspx\",\"(v=ocs.14).aspx\"),A397)),\"\")","v":"Remove-CsAnnouncement"},{"$f":"IF(ISTEXT(B397),(HYPERLINK(SUBSTITUTE(HLINK(B397),\".aspx\",\"\")&IF(D$1=2013,\"(v=ocs.15).aspx\",\"(v=ocs.14).aspx\"),B397)),\"\")","v":"Remove-CsAnnouncement"},"Removes an existing Microsoft Lync Server 2010 announcement. Announcements are played when users dial a valid but unassigned phone number. An announcement can be a message (such as \"This number is temporarily out of service\") or a busy signal.","yes","no","no","no","no","no","yes","no","no","yes","Get-CsAdminRole | ? {$_.Cmdlets –match \"Remove-CsAnnouncement\"}"]
["Remove-CsArchivingConfiguration","Remove-CsArchivingConfiguration",{"$f":"IF(ISTEXT(A398),(HYPERLINK(SUBSTITUTE(HLINK(A398),\".aspx\",\"\")&IF(C$1=2013,\"(v=ocs.15).aspx\",\"(v=ocs.14).aspx\"),A398)),\"\")","v":"Remove-CsArchivingConfiguration"},{"$f":"IF(ISTEXT(B398),(HYPERLINK(SUBSTITUTE(HLINK(B398),\".aspx\",\"\")&IF(D$1=2013,\"(v=ocs.15).aspx\",\"(v=ocs.14).aspx\"),B398)),\"\")","v":"Remove-CsArchivingConfiguration"},"Removes the specified collection of archiving settings. Archiving settings are used to enable or disable the automatic saving of instant messaging (IM) sessions, and to optionally block any instant message that cannot be archived.","yes","yes","no","no","no","no","no","no","no","no","Get-CsAdminRole | ? {$_.Cmdlets –match \"Remove-CsArchivingConfiguration\"}"]
["Remove-CsArchivingPolicy","Remove-CsArchivingPolicy",{"$f":"IF(ISTEXT(A399),(HYPERLINK(SUBSTITUTE(HLINK(A399),\".aspx\",\"\")&IF(C$1=2013,\"(v=ocs.15).aspx\",\"(v=ocs.14).aspx\"),A399)),\"\")","v":"Remove-CsArchivingPolicy"},{"$f":"IF(ISTEXT(B399),(HYPERLINK(SUBSTITUTE(HLINK(B399),\".aspx\",\"\")&IF(D$1=2013,\"(v=ocs.15).aspx\",\"(v=ocs.14).aspx\"),B399)),\"\")","v":"Remove-CsArchivingPolicy"},"Removes the specified instant messaging (IM) archiving policy. IM archiving policies determine whether Microsoft Lync Server 2010 will automatically save all IM sessions that take place between internal users, and/or all IM sessions between internal users and federated partners.","yes","yes","no","no","no","no","no","no","no","no","Get-CsAdminRole | ? {$_.Cmdlets –match \"Remove-CsArchivingPolicy\"}"]
["Remove-CsAutoDisoverConfiguration","Remove-CsAutodiscoverConfiguration",{"$f":"IF(ISTEXT(A400),(HYPERLINK(SUBSTITUTE(HLINK(A400),\".aspx\",\"\")&IF(C$1=2013,\"(v=ocs.15).aspx\",\"(v=ocs.14).aspx\"),A400)),\"\")","v":"Remove-CsAutoDisoverConfiguration"},{"$f":"IF(ISTEXT(B400),(HYPERLINK(SUBSTITUTE(HLINK(B400),\".aspx\",\"\")&IF(D$1=2013,\"(v=ocs.15).aspx\",\"(v=ocs.14).aspx\"),B400)),\"\")","v":"Remove-CsAutodiscoverConfiguration"},"Removes a collection of Autodiscover configuration settings. The Autodiscover service provides a way for client applications such as Lync Web App to locate key resources such as a user's home pool or the URL for joining a dial-in conference. This cmdlet was introduced in the cumulative update for Lync Server 2010: November 2011.","yes","no","no","no","no","no","yes","no","no","no","Get-CsAdminRole | ? {$_.Cmdlets –match \"Remove-CsAutodiscoverConfiguration\"}"]
["Remove-CsAVEdgeConfiguration","Remove-CsAVEdgeConfiguration",{"$f":"IF(ISTEXT(A401),(HYPERLINK(SUBSTITUTE(HLINK(A401),\".aspx\",\"\")&IF(C$1=2013,\"(v=ocs.15).aspx\",\"(v=ocs.14).aspx\"),A401)),\"\")","v":"Remove-CsAVEdgeConfiguration"},{"$f":"IF(ISTEXT(B401),(HYPERLINK(SUBSTITUTE(HLINK(B401),\".aspx\",\"\")&IF(D$1=2013,\"(v=ocs.15).aspx\",\"(v=ocs.14).aspx\"),B401)),\"\")","v":"Remove-CsAVEdgeConfiguration"},"Enables you to remove an existing collection of configuration settings applied to computers running the Access Edge service (these computers are also known as A/V Edge servers). An A/V Edge server enables internal users to share audio and video data with external users (that is, users who are not logged on to your internal network).","yes","no","no","no","no","no","yes","no","no","no","Get-CsAdminRole | ? {$_.Cmdlets –match \"Remove-CsAVEdgeConfiguration\"}"]
[null,"Remove-CsBackupServiceConfiguration",{"$f":"IF(ISTEXT(A402),(HYPERLINK(SUBSTITUTE(HLINK(A402),\".aspx\",\"\")&IF(C$1=2013,\"(v=ocs.15).aspx\",\"(v=ocs.14).aspx\"),A402)),\"\")","v":""},{"$f":"IF(ISTEXT(B402),(HYPERLINK(SUBSTITUTE(HLINK(B402),\".aspx\",\"\")&IF(D$1=2013,\"(v=ocs.15).aspx\",\"(v=ocs.14).aspx\"),B402)),\"\")","v":"Remove-CsBackupServiceConfiguration"},"Resets the properties in the backup service configuration settings for Lync Server 2013 to their default values. These settings include information about the maximum number of simultaneous Windows Communication Framework calls that can be made to the backup service as well as the backup service synchronization interval. This cmdlet was introduced in Lync Server 2013.","yes","no","no","no","no","no","yes","no","no","no",{"$f":"\"Get-CsAdminRole | ? {$_.Cmdlets –match \"& CHAR(34) &B402& CHAR(34) &\"}\"","v":"Get-CsAdminRole | ? {$_.Cmdlets –match \"Remove-CsBackupServiceConfiguration\"}"}]
["Remove-CsBandwidthPolicyServiceConfiguration","Remove-CsBandwidthPolicyServiceConfiguration",{"$f":"IF(ISTEXT(A403),(HYPERLINK(SUBSTITUTE(HLINK(A403),\".aspx\",\"\")&IF(C$1=2013,\"(v=ocs.15).aspx\",\"(v=ocs.14).aspx\"),A403)),\"\")","v":"Remove-CsBandwidthPolicyServiceConfiguration"},{"$f":"IF(ISTEXT(B403),(HYPERLINK(SUBSTITUTE(HLINK(B403),\".aspx\",\"\")&IF(D$1=2013,\"(v=ocs.15).aspx\",\"(v=ocs.14).aspx\"),B403)),\"\")","v":"Remove-CsBandwidthPolicyServiceConfiguration"},"Removes an existing bandwidth policy service configuration.","yes","no","no","no","no","no","yes","no","no","yes","Get-CsAdminRole | ? {$_.Cmdlets –match \"Remove-CsBandwidthPolicyServiceConfiguration\"}"]
["Remove-CsBlockedDomain","Remove-CsBlockedDomain",{"$f":"IF(ISTEXT(A404),(HYPERLINK(SUBSTITUTE(HLINK(A404),\".aspx\",\"\")&IF(C$1=2013,\"(v=ocs.15).aspx\",\"(v=ocs.14).aspx\"),A404)),\"\")","v":"Remove-CsBlockedDomain"},{"$f":"IF(ISTEXT(B404),(HYPERLINK(SUBSTITUTE(HLINK(B404),\".aspx\",\"\")&IF(D$1=2013,\"(v=ocs.15).aspx\",\"(v=ocs.14).aspx\"),B404)),\"\")","v":"Remove-CsBlockedDomain"},"Removes a domain from the list of domains that are blocked for federation. By definition, your users are not allowed to use Microsoft Lync Server 2010 applications to communicate with people from the blocked domain; for example, users cannot use Microsoft Lync 2010 to exchange instant messages with anyone with a SIP account in a domain that appears on the blocked list.","yes","no","no","no","no","no","yes","no","no","no","Get-CsAdminRole | ? {$_.Cmdlets –match \"Remove-CsBlockedDomain\"}"]
["Remove-CsCallParkOrbit","Remove-CsCallParkOrbit",{"$f":"IF(ISTEXT(A405),(HYPERLINK(SUBSTITUTE(HLINK(A405),\".aspx\",\"\")&IF(C$1=2013,\"(v=ocs.15).aspx\",\"(v=ocs.14).aspx\"),A405)),\"\")","v":"Remove-CsCallParkOrbit"},{"$f":"IF(ISTEXT(B405),(HYPERLINK(SUBSTITUTE(HLINK(B405),\".aspx\",\"\")&IF(D$1=2013,\"(v=ocs.15).aspx\",\"(v=ocs.14).aspx\"),B405)),\"\")","v":"Remove-CsCallParkOrbit"},"Removes a specific call park orbit range.","yes","no","no","no","no","no","yes","no","no","yes","Get-CsAdminRole | ? {$_.Cmdlets –match \"Remove-CsCallParkOrbit\"}"]
["Remove-CsCdrConfiguration","Remove-CsCdrConfiguration",{"$f":"IF(ISTEXT(A406),(HYPERLINK(SUBSTITUTE(HLINK(A406),\".aspx\",\"\")&IF(C$1=2013,\"(v=ocs.15).aspx\",\"(v=ocs.14).aspx\"),A406)),\"\")","v":"Remove-CsCdrConfiguration"},{"$f":"IF(ISTEXT(B406),(HYPERLINK(SUBSTITUTE(HLINK(B406),\".aspx\",\"\")&IF(D$1=2013,\"(v=ocs.15).aspx\",\"(v=ocs.14).aspx\"),B406)),\"\")","v":"Remove-CsCdrConfiguration"},"Removes the specified collection of call detail recording (CDR) settings. CDR enables you to track usage of such things as peer-to-peer instant messaging sessions, Voice over Internet Protocol (VoIP) phone calls, and conferencing calls. This usage data includes information about who called whom, when they called, and how long they talked.","yes","no","no","no","no","no","yes","no","no","no","Get-CsAdminRole | ? {$_.Cmdlets –match \"Remove-CsCdrConfiguration\"}"]
["Remove-CsCertificate","Remove-CsCertificate",{"$f":"IF(ISTEXT(A407),(HYPERLINK(SUBSTITUTE(HLINK(A407),\".aspx\",\"\")&IF(C$1=2013,\"(v=ocs.15).aspx\",\"(v=ocs.14).aspx\"),A407)),\"\")","v":"Remove-CsCertificate"},{"$f":"IF(ISTEXT(B407),(HYPERLINK(SUBSTITUTE(HLINK(B407),\".aspx\",\"\")&IF(D$1=2013,\"(v=ocs.15).aspx\",\"(v=ocs.14).aspx\"),B407)),\"\")","v":"Remove-CsCertificate"},"Removes a certificate previously marked as being available for use by Microsoft Lync Server 2010.","no","no","no","no","no","no","no","no","no","no","Get-CsAdminRole | ? {$_.Cmdlets –match \"Remove-CsCertificate\"}"]
["Remove-CsClientPolicy","Remove-CsClientPolicy",{"$f":"IF(ISTEXT(A408),(HYPERLINK(SUBSTITUTE(HLINK(A408),\".aspx\",\"\")&IF(C$1=2013,\"(v=ocs.15).aspx\",\"(v=ocs.14).aspx\"),A408)),\"\")","v":"Remove-CsClientPolicy"},{"$f":"IF(ISTEXT(B408),(HYPERLINK(SUBSTITUTE(HLINK(B408),\".aspx\",\"\")&IF(D$1=2013,\"(v=ocs.15).aspx\",\"(v=ocs.14).aspx\"),B408)),\"\")","v":"Remove-CsClientPolicy"},"Removes an existing client policy. Among other things, client policies help determine the features of Microsoft Lync 2010 that are available to users; for example, you might give some users the right to transfer files while denying this right to other users.","yes","no","no","no","no","no","yes","no","no","no","Get-CsAdminRole | ? {$_.Cmdlets –match \"Remove-CsClientPolicy\"}"]
["Remove-CsClientVersionConfiguration","Remove-CsClientVersionConfiguration",{"$f":"IF(ISTEXT(A409),(HYPERLINK(SUBSTITUTE(HLINK(A409),\".aspx\",\"\")&IF(C$1=2013,\"(v=ocs.15).aspx\",\"(v=ocs.14).aspx\"),A409)),\"\")","v":"Remove-CsClientVersionConfiguration"},{"$f":"IF(ISTEXT(B409),(HYPERLINK(SUBSTITUTE(HLINK(B409),\".aspx\",\"\")&IF(D$1=2013,\"(v=ocs.15).aspx\",\"(v=ocs.14).aspx\"),B409)),\"\")","v":"Remove-CsClientVersionConfiguration"},"Removes the specified collection of client version configuration settings. Client version configuration settings determine whether or not Microsoft Lync Server 2010 checks the version number of each client application that logs on to the system. If client version filtering is enabled, then the ability of that client application to access the system will be based on settings configured in the appropriate client version policy.","yes","no","no","no","no","no","yes","no","no","no","Get-CsAdminRole | ? {$_.Cmdlets –match \"Remove-CsClientVersionConfiguration\"}"]
["Remove-CsClientVersionPolicy","Remove-CsClientVersionPolicy",{"$f":"IF(ISTEXT(A410),(HYPERLINK(SUBSTITUTE(HLINK(A410),\".aspx\",\"\")&IF(C$1=2013,\"(v=ocs.15).aspx\",\"(v=ocs.14).aspx\"),A410)),\"\")","v":"Remove-CsClientVersionPolicy"},{"$f":"IF(ISTEXT(B410),(HYPERLINK(SUBSTITUTE(HLINK(B410),\".aspx\",\"\")&IF(D$1=2013,\"(v=ocs.15).aspx\",\"(v=ocs.14).aspx\"),B410)),\"\")","v":"Remove-CsClientVersionPolicy"},"Removes the specified client version policy. Client version policies enable you to specify which clients (such as Microsoft Office Communicator 2007 R2) will be able to log on to your Microsoft Lync Server 2010 system.","yes","no","no","no","no","no","yes","no","no","no","Get-CsAdminRole | ? {$_.Cmdlets –match \"Remove-CsClientVersionPolicy\"}"]
["Remove-CsClientVersionPolicyRule","Remove-CsClientVersionPolicyRule",{"$f":"IF(ISTEXT(A411),(HYPERLINK(SUBSTITUTE(HLINK(A411),\".aspx\",\"\")&IF(C$1=2013,\"(v=ocs.15).aspx\",\"(v=ocs.14).aspx\"),A411)),\"\")","v":"Remove-CsClientVersionPolicyRule"},{"$f":"IF(ISTEXT(B411),(HYPERLINK(SUBSTITUTE(HLINK(B411),\".aspx\",\"\")&IF(D$1=2013,\"(v=ocs.15).aspx\",\"(v=ocs.14).aspx\"),B411)),\"\")","v":"Remove-CsClientVersionPolicyRule"},"Removes one or more client version policy rules configured for use in your organization.","yes","no","no","no","no","no","yes","no","no","no","Get-CsAdminRole | ? {$_.Cmdlets –match \"Remove-CsClientVersionPolicyRule\"}"]
[null,"Remove-CsClsConfiguration",{"$f":"IF(ISTEXT(A412),(HYPERLINK(SUBSTITUTE(HLINK(A412),\".aspx\",\"\")&IF(C$1=2013,\"(v=ocs.15).aspx\",\"(v=ocs.14).aspx\"),A412)),\"\")","v":""},{"$f":"IF(ISTEXT(B412),(HYPERLINK(SUBSTITUTE(HLINK(B412),\".aspx\",\"\")&IF(D$1=2013,\"(v=ocs.15).aspx\",\"(v=ocs.14).aspx\"),B412)),\"\")","v":"Remove-CsClsConfiguration"},"Removes one or more collections of centralized logging configuration settings. Centralized logging provides a way for administrators to simultaneously enable or disable event tracing on multiple computers. This cmdlet was introduced in Lync Server 2013.","yes","no","no","no","no","no","yes","no","no","no","Get-CsAdminRole | ? {$_.Cmdlets –match \"Remove-CsClsConfiguration\"}"]
[null,"Remove-CsClsRegion",{"$f":"IF(ISTEXT(A413),(HYPERLINK(SUBSTITUTE(HLINK(A413),\".aspx\",\"\")&IF(C$1=2013,\"(v=ocs.15).aspx\",\"(v=ocs.14).aspx\"),A413)),\"\")","v":""},{"$f":"IF(ISTEXT(B413),(HYPERLINK(SUBSTITUTE(HLINK(B413),\".aspx\",\"\")&IF(D$1=2013,\"(v=ocs.15).aspx\",\"(v=ocs.14).aspx\"),B413)),\"\")","v":"Remove-CsClsRegion"},"Removes one or more centralized logging configuration regions. Centralized logging provides a way for administrators to simultaneously enable or disable event tracing on multiple computers. Centralized logging regions are intended for use with Lync Online. This cmdlet was introduced in Lync Server 2013.","yes","no","no","no","no","no","yes","no","no","no",{"$f":"\"Get-CsAdminRole | ? {$_.Cmdlets –match \"& CHAR(34) &B413& CHAR(34) &\"}\"","v":"Get-CsAdminRole | ? {$_.Cmdlets –match \"Remove-CsClsRegion\"}"}]
[null,"Remove-CsClsScenario",{"$f":"IF(ISTEXT(A414),(HYPERLINK(SUBSTITUTE(HLINK(A414),\".aspx\",\"\")&IF(C$1=2013,\"(v=ocs.15).aspx\",\"(v=ocs.14).aspx\"),A414)),\"\")","v":""},{"$f":"IF(ISTEXT(B414),(HYPERLINK(SUBSTITUTE(HLINK(B414),\".aspx\",\"\")&IF(D$1=2013,\"(v=ocs.15).aspx\",\"(v=ocs.14).aspx\"),B414)),\"\")","v":"Remove-CsClsScenario"},"Removes the specified centralized logging configuration scenario. A scenario represents a particular Lync Server 2013 component or situation (such as IM and presence) that administrators can enable or disable for tracing. This cmdlet was introduced in Lync Server 2013.","yes","no","no","no","no","no","yes","no","no","no","Get-CsAdminRole | ? {$_.Cmdlets –match \"Remove-CsClsScenario\"}"]
[null,"Remove-CsClsSecurityGroup",{"$f":"IF(ISTEXT(A415),(HYPERLINK(SUBSTITUTE(HLINK(A415),\".aspx\",\"\")&IF(C$1=2013,\"(v=ocs.15).aspx\",\"(v=ocs.14).aspx\"),A415)),\"\")","v":""},{"$f":"IF(ISTEXT(B415),(HYPERLINK(SUBSTITUTE(HLINK(B415),\".aspx\",\"\")&IF(D$1=2013,\"(v=ocs.15).aspx\",\"(v=ocs.14).aspx\"),B415)),\"\")","v":"Remove-CsClsSecurityGroup"},"Removes a centralized logging configuration security group. Centralized logging provides a way for administrators to simultaneously enable or disable event tracing on multiple computers. This cmdlet was introduced in Lync Server 2013.","yes","no","no","no","no","no","yes","no","no","no","Get-CsAdminRole | ? {$_.Cmdlets –match \"Remove-CsClsSecurityGroup\"}"]
["Remove-CsCommonAreaPhone","Remove-CsCommonAreaPhone",{"$f":"IF(ISTEXT(A416),(HYPERLINK(SUBSTITUTE(HLINK(A416),\".aspx\",\"\")&IF(C$1=2013,\"(v=ocs.15).aspx\",\"(v=ocs.14).aspx\"),A416)),\"\")","v":"Remove-CsCommonAreaPhone"},{"$f":"IF(ISTEXT(B416),(HYPERLINK(SUBSTITUTE(HLINK(B416),\".aspx\",\"\")&IF(D$1=2013,\"(v=ocs.15).aspx\",\"(v=ocs.14).aspx\"),B416)),\"\")","v":"Remove-CsCommonAreaPhone"},"Removes an existing common area phone from the collection of phones managed by using Microsoft Lync Server 2010. Common area phones are phones that are located in building lobbies, employee lounges, or other areas where they are likely to be used by a number of different people and for a number of different uses.","yes","no","no","no","no","no","yes","yes","no","yes","Get-CsAdminRole | ? {$_.Cmdlets –match \"Remove-CsCommonAreaPhone\"}"]
["Remove-CsConferenceDirectory","Remove-CsConferenceDirectory",{"$f":"IF(ISTEXT(A417),(HYPERLINK(SUBSTITUTE(HLINK(A417),\".aspx\",\"\")&IF(C$1=2013,\"(v=ocs.15).aspx\",\"(v=ocs.14).aspx\"),A417)),\"\")","v":"Remove-CsConferenceDirectory"},{"$f":"IF(ISTEXT(B417),(HYPERLINK(SUBSTITUTE(HLINK(B417),\".aspx\",\"\")&IF(D$1=2013,\"(v=ocs.15).aspx\",\"(v=ocs.14).aspx\"),B417)),\"\")","v":"Remove-CsConferenceDirectory"},"Removes an existing conference directory. Conference directories are used to help dial-in conferencing users locate conference information.","yes","no","no","no","no","no","yes","no","no","no","Get-CsAdminRole | ? {$_.Cmdlets –match \"Remove-CsConferenceDirectory\"}"]
["Remove-CsConferenceDisclaimer","Remove-CsConferenceDisclaimer",{"$f":"IF(ISTEXT(A418),(HYPERLINK(SUBSTITUTE(HLINK(A418),\".aspx\",\"\")&IF(C$1=2013,\"(v=ocs.15).aspx\",\"(v=ocs.14).aspx\"),A418)),\"\")","v":"Remove-CsConferenceDisclaimer"},{"$f":"IF(ISTEXT(B418),(HYPERLINK(SUBSTITUTE(HLINK(B418),\".aspx\",\"\")&IF(D$1=2013,\"(v=ocs.15).aspx\",\"(v=ocs.14).aspx\"),B418)),\"\")","v":"Remove-CsConferenceDisclaimer"},"Clears the text from the header and body of the conference disclaimer used in your organization. The conference disclaimer is a message that is displayed to users who join the conference by using a hyperlink (for example, users who paste a link to the conference into a browser such as Windows Internet Explorer).","yes","no","no","no","no","no","yes","no","no","no","Get-CsAdminRole | ? {$_.Cmdlets –match \"Remove-CsConferenceDisclaimer\"}"]
["Remove-CsConferencingConfiguration","Remove-CsConferencingConfiguration",{"$f":"IF(ISTEXT(A419),(HYPERLINK(SUBSTITUTE(HLINK(A419),\".aspx\",\"\")&IF(C$1=2013,\"(v=ocs.15).aspx\",\"(v=ocs.14).aspx\"),A419)),\"\")","v":"Remove-CsConferencingConfiguration"},{"$f":"IF(ISTEXT(B419),(HYPERLINK(SUBSTITUTE(HLINK(B419),\".aspx\",\"\")&IF(D$1=2013,\"(v=ocs.15).aspx\",\"(v=ocs.14).aspx\"),B419)),\"\")","v":"Remove-CsConferencingConfiguration"},"Removes the specified collection of conference configuration settings. Conference settings determine such things as the maximum-allowed size for conference content and handouts; the content grace period; and the URLs for the internal and external downloads of the supported client.","yes","no","no","no","no","no","yes","no","no","no","Get-CsAdminRole | ? {$_.Cmdlets –match \"Remove-CsConferencingConfiguration\"}"]
["Remove-CsConferencingPolicy","Remove-CsConferencingPolicy",{"$f":"IF(ISTEXT(A420),(HYPERLINK(SUBSTITUTE(HLINK(A420),\".aspx\",\"\")&IF(C$1=2013,\"(v=ocs.15).aspx\",\"(v=ocs.14).aspx\"),A420)),\"\")","v":"Remove-CsConferencingPolicy"},{"$f":"IF(ISTEXT(B420),(HYPERLINK(SUBSTITUTE(HLINK(B420),\".aspx\",\"\")&IF(D$1=2013,\"(v=ocs.15).aspx\",\"(v=ocs.14).aspx\"),B420)),\"\")","v":"Remove-CsConferencingPolicy"},"Removes the specified conferencing policy. Conferencing policies determine the features and capabilities that can be used in a conference; this includes everything from whether or not the conference can include IP audio and video to the maximum number of people who can attend a meeting.","yes","no","no","no","no","no","yes","no","no","no","Get-CsAdminRole | ? {$_.Cmdlets –match \"Remove-CsConferencingPolicy\"}"]
["Remove-CsConfigurationStoreLocation","Remove-CsConfigurationStoreLocation",{"$f":"IF(ISTEXT(A421),(HYPERLINK(SUBSTITUTE(HLINK(A421),\".aspx\",\"\")&IF(C$1=2013,\"(v=ocs.15).aspx\",\"(v=ocs.14).aspx\"),A421)),\"\")","v":"Remove-CsConfigurationStoreLocation"},{"$f":"IF(ISTEXT(B421),(HYPERLINK(SUBSTITUTE(HLINK(B421),\".aspx\",\"\")&IF(D$1=2013,\"(v=ocs.15).aspx\",\"(v=ocs.14).aspx\"),B421)),\"\")","v":"Remove-CsConfigurationStoreLocation"},"Removes the Active Directory service control point for the Central Management store.","no","no","no","no","no","no","no","no","no","no","Get-CsAdminRole | ? {$_.Cmdlets –match \"Remove-CsConfigurationStoreLocation\"}"]
["Remove-CsCpsConfiguration","Remove-CsCpsConfiguration",{"$f":"IF(ISTEXT(A422),(HYPERLINK(SUBSTITUTE(HLINK(A422),\".aspx\",\"\")&IF(C$1=2013,\"(v=ocs.15).aspx\",\"(v=ocs.14).aspx\"),A422)),\"\")","v":"Remove-CsCpsConfiguration"},{"$f":"IF(ISTEXT(B422),(HYPERLINK(SUBSTITUTE(HLINK(B422),\".aspx\",\"\")&IF(D$1=2013,\"(v=ocs.15).aspx\",\"(v=ocs.14).aspx\"),B422)),\"\")","v":"Remove-CsCpsConfiguration"},"Removes an existing Call Park service configuration. Call parking is a service that allows a user to \"park\" an incoming phone call. Parking a call transfers it to a number in a specified range, or orbit, and then immediately places the call on hold. Anyone (not just the person who originally answered the call) can resume the conversation from any telephone simply by entering the correct number.","yes","no","no","no","no","no","yes","no","no","yes","Get-CsAdminRole | ? {$_.Cmdlets –match \"Remove-CsCpsConfiguration\"}"]
["Remove-CsDeviceUpdateConfiguration","Remove-CsDeviceUpdateConfiguration",{"$f":"IF(ISTEXT(A423),(HYPERLINK(SUBSTITUTE(HLINK(A423),\".aspx\",\"\")&IF(C$1=2013,\"(v=ocs.15).aspx\",\"(v=ocs.14).aspx\"),A423)),\"\")","v":"Remove-CsDeviceUpdateConfiguration"},{"$f":"IF(ISTEXT(B423),(HYPERLINK(SUBSTITUTE(HLINK(B423),\".aspx\",\"\")&IF(D$1=2013,\"(v=ocs.15).aspx\",\"(v=ocs.14).aspx\"),B423)),\"\")","v":"Remove-CsDeviceUpdateConfiguration"},"Removes the specified device update configuration settings. These settings help manage the Device Update Web service, a Microsoft Lync Server 2010 component that enables administrators to distribute firmware updates to telephones and other devices running Microsoft Lync 2010 Phone Edition.","yes","no","no","no","no","no","yes","no","no","yes","Get-CsAdminRole | ? {$_.Cmdlets –match \"Remove-CsDeviceUpdateConfiguration\"}"]
["Remove-CsDeviceUpdateRule","Remove-CsDeviceUpdateRule",{"$f":"IF(ISTEXT(A424),(HYPERLINK(SUBSTITUTE(HLINK(A424),\".aspx\",\"\")&IF(C$1=2013,\"(v=ocs.15).aspx\",\"(v=ocs.14).aspx\"),A424)),\"\")","v":"Remove-CsDeviceUpdateRule"},{"$f":"IF(ISTEXT(B424),(HYPERLINK(SUBSTITUTE(HLINK(B424),\".aspx\",\"\")&IF(D$1=2013,\"(v=ocs.15).aspx\",\"(v=ocs.14).aspx\"),B424)),\"\")","v":"Remove-CsDeviceUpdateRule"},"Removes a device update rule configured for use in your organization. Device update rules are used to associate firmware updates with devices that run Microsoft Lync 2010 Phone Edition.","yes","no","no","no","no","no","yes","no","no","yes","Get-CsAdminRole | ? {$_.Cmdlets –match \"Remove-CsDeviceUpdateRule\"}"]
["Remove-CsDiagnosticConfiguration","Remove-CsDiagnosticConfiguration",{"$f":"IF(ISTEXT(A425),(HYPERLINK(SUBSTITUTE(HLINK(A425),\".aspx\",\"\")&IF(C$1=2013,\"(v=ocs.15).aspx\",\"(v=ocs.14).aspx\"),A425)),\"\")","v":"Remove-CsDiagnosticConfiguration"},{"$f":"IF(ISTEXT(B425),(HYPERLINK(SUBSTITUTE(HLINK(B425),\".aspx\",\"\")&IF(D$1=2013,\"(v=ocs.15).aspx\",\"(v=ocs.14).aspx\"),B425)),\"\")","v":"Remove-CsDiagnosticConfiguration"},"Removes one or more of the diagnostic configuration settings collections currently in use in your organization. Diagnostic configuration settings are used to determine whether traffic to or from a given domain or Uniform Resource Identifier (URI) is recorded in your Microsoft Lync Server 2010 log files.","yes","no","no","no","no","no","yes","no","no","no","Get-CsAdminRole | ? {$_.Cmdlets –match \"Remove-CsDiagnosticConfiguration\"}"]
["Remove-CsDiagnosticHeaderConfiguration","Remove-CsDiagnosticHeaderConfiguration",{"$f":"IF(ISTEXT(A426),(HYPERLINK(SUBSTITUTE(HLINK(A426),\".aspx\",\"\")&IF(C$1=2013,\"(v=ocs.15).aspx\",\"(v=ocs.14).aspx\"),A426)),\"\")","v":"Remove-CsDiagnosticHeaderConfiguration"},{"$f":"IF(ISTEXT(B426),(HYPERLINK(SUBSTITUTE(HLINK(B426),\".aspx\",\"\")&IF(D$1=2013,\"(v=ocs.15).aspx\",\"(v=ocs.14).aspx\"),B426)),\"\")","v":"Remove-CsDiagnosticHeaderConfiguration"},"Removes one or more of the diagnostic header configuration setting collections currently in use in your organization. Diagnostic header configuration settings determine whether SIP messages are accompanied by header information that can be useful in troubleshooting and error reporting.","yes","no","no","no","no","no","yes","no","no","no","Get-CsAdminRole | ? {$_.Cmdlets –match \"Remove-CsDiagnosticHeaderConfiguration\"}"]
["Remove-CsDialInConferencingAccessNumber","Remove-CsDialInConferencingAccessNumber",{"$f":"IF(ISTEXT(A427),(HYPERLINK(SUBSTITUTE(HLINK(A427),\".aspx\",\"\")&IF(C$1=2013,\"(v=ocs.15).aspx\",\"(v=ocs.14).aspx\"),A427)),\"\")","v":"Remove-CsDialInConferencingAccessNumber"},{"$f":"IF(ISTEXT(B427),(HYPERLINK(SUBSTITUTE(HLINK(B427),\".aspx\",\"\")&IF(D$1=2013,\"(v=ocs.15).aspx\",\"(v=ocs.14).aspx\"),B427)),\"\")","v":"Remove-CsDialInConferencingAccessNumber"},"Removes an existing dial-in conferencing access number. Dial-in conferencing provides a way for users to use a \"regular\" telephone or mobile phone (that is, a device on the public switched telephone network (PSTN)) to join the audio portion of a conference.","yes","no","no","no","no","no","yes","no","no","no","Get-CsAdminRole | ? {$_.Cmdlets –match \"Remove-CsDialInConferencingAccessNumber\"}"]
["Remove-CsDialInConferencingConfiguration","Remove-CsDialInConferencingConfiguration",{"$f":"IF(ISTEXT(A428),(HYPERLINK(SUBSTITUTE(HLINK(A428),\".aspx\",\"\")&IF(C$1=2013,\"(v=ocs.15).aspx\",\"(v=ocs.14).aspx\"),A428)),\"\")","v":"Remove-CsDialInConferencingConfiguration"},{"$f":"IF(ISTEXT(B428),(HYPERLINK(SUBSTITUTE(HLINK(B428),\".aspx\",\"\")&IF(D$1=2013,\"(v=ocs.15).aspx\",\"(v=ocs.14).aspx\"),B428)),\"\")","v":"Remove-CsDialInConferencingConfiguration"},"Removes one or more collections of dial-in conferencing configuration settings. These settings determine how Microsoft Lync Server 2010 responds when users join or leave a dial-in conference.","yes","no","no","no","no","no","yes","no","no","no","Get-CsAdminRole | ? {$_.Cmdlets –match \"Remove-CsDialInConferencingConfiguration\"}"]
["Remove-CsDialInConferencingDtmfConfiguration","Remove-CsDialInConferencingDtmfConfiguration",{"$f":"IF(ISTEXT(A429),(HYPERLINK(SUBSTITUTE(HLINK(A429),\".aspx\",\"\")&IF(C$1=2013,\"(v=ocs.15).aspx\",\"(v=ocs.14).aspx\"),A429)),\"\")","v":"Remove-CsDialInConferencingDtmfConfiguration"},{"$f":"IF(ISTEXT(B429),(HYPERLINK(SUBSTITUTE(HLINK(B429),\".aspx\",\"\")&IF(D$1=2013,\"(v=ocs.15).aspx\",\"(v=ocs.14).aspx\"),B429)),\"\")","v":"Remove-CsDialInConferencingDtmfConfiguration"},"Removes an existing collection of dual-tone multifrequency (DTMF) signaling settings used for dial-in conferencing. DTMF enables users who dial in to a conference to control conference settings (such as muting and unmuting themselves or locking and unlocking the conference) by using the keypad on their telephone.","yes","no","no","no","no","no","yes","no","no","no","Get-CsAdminRole | ? {$_.Cmdlets –match \"Remove-CsDialInConferencingDtmfConfiguration\"}"]
["Remove-CsDialPlan","Remove-CsDialPlan",{"$f":"IF(ISTEXT(A430),(HYPERLINK(SUBSTITUTE(HLINK(A430),\".aspx\",\"\")&IF(C$1=2013,\"(v=ocs.15).aspx\",\"(v=ocs.14).aspx\"),A430)),\"\")","v":"Remove-CsDialPlan"},{"$f":"IF(ISTEXT(B430),(HYPERLINK(SUBSTITUTE(HLINK(B430),\".aspx\",\"\")&IF(D$1=2013,\"(v=ocs.15).aspx\",\"(v=ocs.14).aspx\"),B430)),\"\")","v":"Remove-CsDialPlan"},"Removes the specified dial plan. This cmdlet can also be used to remove the global dial plan. If you remove the global dial plan, however, the dial plan will not actually be removed; instead, the settings will simply be reset to their default values.","yes","no","no","no","no","no","yes","no","no","yes","Get-CsAdminRole | ? {$_.Cmdlets –match \"Remove-CsDialPlan\"}"]
["Remove-CsEnhancedEmergencyServiceDisclaimer","Remove-CsEnhancedEmergencyServiceDisclaimer",{"$f":"IF(ISTEXT(A431),(HYPERLINK(SUBSTITUTE(HLINK(A431),\".aspx\",\"\")&IF(C$1=2013,\"(v=ocs.15).aspx\",\"(v=ocs.14).aspx\"),A431)),\"\")","v":"Remove-CsEnhancedEmergencyServiceDisclaimer"},{"$f":"IF(ISTEXT(B431),(HYPERLINK(SUBSTITUTE(HLINK(B431),\".aspx\",\"\")&IF(D$1=2013,\"(v=ocs.15).aspx\",\"(v=ocs.14).aspx\"),B431)),\"\")","v":"Remove-CsEnhancedEmergencyServiceDisclaimer"},"Removes the disclaimer text that is used globally to prompt for location information for an Enhanced 9-1-1 (E9-1-1) implementation.","yes","no","no","no","no","no","yes","no","no","yes","Get-CsAdminRole | ? {$_.Cmdlets –match \"Remove-CsEnhancedEmergencyServiceDisclaimer\"}"]
["Remove-CsExternalAccessPolicy","Remove-CsExternalAccessPolicy",{"$f":"IF(ISTEXT(A432),(HYPERLINK(SUBSTITUTE(HLINK(A432),\".aspx\",\"\")&IF(C$1=2013,\"(v=ocs.15).aspx\",\"(v=ocs.14).aspx\"),A432)),\"\")","v":"Remove-CsExternalAccessPolicy"},{"$f":"IF(ISTEXT(B432),(HYPERLINK(SUBSTITUTE(HLINK(B432),\".aspx\",\"\")&IF(D$1=2013,\"(v=ocs.15).aspx\",\"(v=ocs.14).aspx\"),B432)),\"\")","v":"Remove-CsExternalAccessPolicy"},"Enables you to remove an existing external access policy. External access policies determine whether or not your users can: 1) communicate with users who have Session Initiation Protocol (SIP) accounts with a federated organization; 2) communicate with users who have SIP accounts with a public instant messaging (IM) provider such as Windows Live; and, 3) access Microsoft Lync Server 2010 over the Internet, without having to log on to your internal network.","yes","no","no","no","no","no","yes","no","no","no","Get-CsAdminRole | ? {$_.Cmdlets –match \"Remove-CsExternalAccessPolicy\"}"]
["Remove-CsExUmContact","Remove-CsExUmContact",{"$f":"IF(ISTEXT(A433),(HYPERLINK(SUBSTITUTE(HLINK(A433),\".aspx\",\"\")&IF(C$1=2013,\"(v=ocs.15).aspx\",\"(v=ocs.14).aspx\"),A433)),\"\")","v":"Remove-CsExUmContact"},{"$f":"IF(ISTEXT(B433),(HYPERLINK(SUBSTITUTE(HLINK(B433),\".aspx\",\"\")&IF(D$1=2013,\"(v=ocs.15).aspx\",\"(v=ocs.14).aspx\"),B433)),\"\")","v":"Remove-CsExUmContact"},"Removes an Auto Attendant or Subscriber Access contact object for hosted Exchange Unified Messaging (UM).","yes","no","no","no","no","no","yes","yes","no","yes","Get-CsAdminRole | ? {$_.Cmdlets –match \"Remove-CsExUmContact\"}"]
["Remove-CsFileTransferFilterConfiguration","Remove-CsFileTransferFilterConfiguration",{"$f":"IF(ISTEXT(A434),(HYPERLINK(SUBSTITUTE(HLINK(A434),\".aspx\",\"\")&IF(C$1=2013,\"(v=ocs.15).aspx\",\"(v=ocs.14).aspx\"),A434)),\"\")","v":"Remove-CsFileTransferFilterConfiguration"},{"$f":"IF(ISTEXT(B434),(HYPERLINK(SUBSTITUTE(HLINK(B434),\".aspx\",\"\")&IF(D$1=2013,\"(v=ocs.15).aspx\",\"(v=ocs.14).aspx\"),B434)),\"\")","v":"Remove-CsFileTransferFilterConfiguration"},"Removes the specified instant message file transfer filter configuration. (Instant message file transfer filter settings are used to block a user's ability to transfer certain types of files within an instant message.)","yes","no","no","no","no","no","yes","no","no","no","Get-CsAdminRole | ? {$_.Cmdlets –match \"Remove-CsFileTransferFilterConfiguration\"}"]
[null,"Remove-CsFIPSConfiguration",{"$f":"IF(ISTEXT(A435),(HYPERLINK(SUBSTITUTE(HLINK(A435),\".aspx\",\"\")&IF(C$1=2013,\"(v=ocs.15).aspx\",\"(v=ocs.14).aspx\"),A435)),\"\")","v":""},{"$f":"IF(ISTEXT(B435),(HYPERLINK(SUBSTITUTE(HLINK(B435),\".aspx\",\"\")&IF(D$1=2013,\"(v=ocs.15).aspx\",\"(v=ocs.14).aspx\"),B435)),\"\")","v":"Remove-CsFIPSConfiguration"},"Removes one or more collections of Federal Information Processing Standards (FIPS) configuration settings. The FIPS standards are a set of United States government security standards required for use in computers maintained by non-military government agencies and by government contractors. This cmdlet was introduced in Lync Server 2013.","yes","no","no","no","no","no","yes","no","no","no","Get-CsAdminRole | ? {$_.Cmdlets –match \"Remove-CsFIPSConfiguration\"}"]
["Remove-CsHealthMonitoringConfiguration","Remove-CsHealthMonitoringConfiguration",{"$f":"IF(ISTEXT(A436),(HYPERLINK(SUBSTITUTE(HLINK(A436),\".aspx\",\"\")&IF(C$1=2013,\"(v=ocs.15).aspx\",\"(v=ocs.14).aspx\"),A436)),\"\")","v":"Remove-CsHealthMonitoringConfiguration"},{"$f":"IF(ISTEXT(B436),(HYPERLINK(SUBSTITUTE(HLINK(B436),\".aspx\",\"\")&IF(D$1=2013,\"(v=ocs.15).aspx\",\"(v=ocs.14).aspx\"),B436)),\"\")","v":"Remove-CsHealthMonitoringConfiguration"},"Removes an existing collection of health monitoring configuration settings. These settings enable administrators to run quality assurance tests without having to supply the user names and passwords for the required test accounts.","yes","no","no","no","no","no","yes","no","no","no","Get-CsAdminRole | ? {$_.Cmdlets –match \"Remove-CsHealthMonitoringConfiguration\"}"]
["Remove-CsHostedVoicemailPolicy","Remove-CsHostedVoicemailPolicy",{"$f":"IF(ISTEXT(A437),(HYPERLINK(SUBSTITUTE(HLINK(A437),\".aspx\",\"\")&IF(C$1=2013,\"(v=ocs.15).aspx\",\"(v=ocs.14).aspx\"),A437)),\"\")","v":"Remove-CsHostedVoicemailPolicy"},{"$f":"IF(ISTEXT(B437),(HYPERLINK(SUBSTITUTE(HLINK(B437),\".aspx\",\"\")&IF(D$1=2013,\"(v=ocs.15).aspx\",\"(v=ocs.14).aspx\"),B437)),\"\")","v":"Remove-CsHostedVoicemailPolicy"},"Removes a hosted voice mail policy.","yes","no","no","no","no","no","yes","no","no","yes","Get-CsAdminRole | ? {$_.Cmdlets –match \"Remove-CsHostedVoicemailPolicy\"}"]
["Remove-CsHostingProvider","Remove-CsHostingProvider",{"$f":"IF(ISTEXT(A438),(HYPERLINK(SUBSTITUTE(HLINK(A438),\".aspx\",\"\")&IF(C$1=2013,\"(v=ocs.15).aspx\",\"(v=ocs.14).aspx\"),A438)),\"\")","v":"Remove-CsHostingProvider"},{"$f":"IF(ISTEXT(B438),(HYPERLINK(SUBSTITUTE(HLINK(B438),\".aspx\",\"\")&IF(D$1=2013,\"(v=ocs.15).aspx\",\"(v=ocs.14).aspx\"),B438)),\"\")","v":"Remove-CsHostingProvider"},"Removes one or more of the hosting providers currently in use in your organization. A hosting provider is a third-party organization that provides instant messaging, presence, and related services for a domain that you would like to federate with. Hosting providers, suchMicrosoft Lync Online 2010, differ from public providers (such as Yahoo!, MSN, and AOL) in that their services are not offered to the general public.","yes","no","no","no","no","no","yes","no","no","no","Get-CsAdminRole | ? {$_.Cmdlets –match \"Remove-CsHostingProvider\"}"]
["Remove-CsImFilterConfiguration","Remove-CsImFilterConfiguration",{"$f":"IF(ISTEXT(A439),(HYPERLINK(SUBSTITUTE(HLINK(A439),\".aspx\",\"\")&IF(C$1=2013,\"(v=ocs.15).aspx\",\"(v=ocs.14).aspx\"),A439)),\"\")","v":"Remove-CsImFilterConfiguration"},{"$f":"IF(ISTEXT(B439),(HYPERLINK(SUBSTITUTE(HLINK(B439),\".aspx\",\"\")&IF(D$1=2013,\"(v=ocs.15).aspx\",\"(v=ocs.14).aspx\"),B439)),\"\")","v":"Remove-CsImFilterConfiguration"},"Removes the specified instant messaging (IM) filter configuration. (IM filter settings are used to prevent users from sending instant messages that contain hyperlinks.)","yes","no","no","no","no","no","yes","no","no","no","Get-CsAdminRole | ? {$_.Cmdlets –match \"Remove-CsImFilterConfiguration\"}"]
["Remove-CsKerberosAccountAssignment","Remove-CsKerberosAccountAssignment",{"$f":"IF(ISTEXT(A440),(HYPERLINK(SUBSTITUTE(HLINK(A440),\".aspx\",\"\")&IF(C$1=2013,\"(v=ocs.15).aspx\",\"(v=ocs.14).aspx\"),A440)),\"\")","v":"Remove-CsKerberosAccountAssignment"},{"$f":"IF(ISTEXT(B440),(HYPERLINK(SUBSTITUTE(HLINK(B440),\".aspx\",\"\")&IF(D$1=2013,\"(v=ocs.15).aspx\",\"(v=ocs.14).aspx\"),B440)),\"\")","v":"Remove-CsKerberosAccountAssignment"},"Removes one or more Kerberos account assignments.","no","no","no","no","no","no","no","no","no","no","Get-CsAdminRole | ? {$_.Cmdlets –match \"Remove-CsKerberosAccountAssignment\"}"]
["Remove-CsLisLocation","Remove-CsLisLocation",{"$f":"IF(ISTEXT(A441),(HYPERLINK(SUBSTITUTE(HLINK(A441),\".aspx\",\"\")&IF(C$1=2013,\"(v=ocs.15).aspx\",\"(v=ocs.14).aspx\"),A441)),\"\")","v":"Remove-CsLisLocation"},{"$f":"IF(ISTEXT(B441),(HYPERLINK(SUBSTITUTE(HLINK(B441),\".aspx\",\"\")&IF(D$1=2013,\"(v=ocs.15).aspx\",\"(v=ocs.14).aspx\"),B441)),\"\")","v":"Remove-CsLisLocation"},"Removes a location from the location configuration database for Enhanced 9-1-1 (E9-1-1).","yes","no","no","yes","no","no","yes","no","no","yes","Get-CsAdminRole | ? {$_.Cmdlets –match \"Remove-CsLisLocation\"}"]
["Remove-CsLisPort","Remove-CsLisPort",{"$f":"IF(ISTEXT(A442),(HYPERLINK(SUBSTITUTE(HLINK(A442),\".aspx\",\"\")&IF(C$1=2013,\"(v=ocs.15).aspx\",\"(v=ocs.14).aspx\"),A442)),\"\")","v":"Remove-CsLisPort"},{"$f":"IF(ISTEXT(B442),(HYPERLINK(SUBSTITUTE(HLINK(B442),\".aspx\",\"\")&IF(D$1=2013,\"(v=ocs.15).aspx\",\"(v=ocs.14).aspx\"),B442)),\"\")","v":"Remove-CsLisPort"},"Removes an association between a Location Information Server (LIS) port and a location. This association is used in an Enhanced 9-1-1 (E9-1-1) Enterprise Voice implementation to notify an emergency services operator of the caller's location.","yes","no","no","yes","no","no","yes","no","no","yes","Get-CsAdminRole | ? {$_.Cmdlets –match \"Remove-CsLisPort\"}"]
["Remove-CsLisServiceProvider","Remove-CsLisServiceProvider",{"$f":"IF(ISTEXT(A443),(HYPERLINK(SUBSTITUTE(HLINK(A443),\".aspx\",\"\")&IF(C$1=2013,\"(v=ocs.15).aspx\",\"(v=ocs.14).aspx\"),A443)),\"\")","v":"Remove-CsLisServiceProvider"},{"$f":"IF(ISTEXT(B443),(HYPERLINK(SUBSTITUTE(HLINK(B443),\".aspx\",\"\")&IF(D$1=2013,\"(v=ocs.15).aspx\",\"(v=ocs.14).aspx\"),B443)),\"\")","v":"Remove-CsLisServiceProvider"},"Removes an object containing information about the web service provided by the Enhanced 9-1-1 (E9-1-1) Network Routing Provider to verify locations.","yes","no","no","no","no","no","yes","no","no","yes","Get-CsAdminRole | ? {$_.Cmdlets –match \"Remove-CsLisServiceProvider\"}"]
["Remove-CsLisSubnet","Remove-CsLisSubnet",{"$f":"IF(ISTEXT(A444),(HYPERLINK(SUBSTITUTE(HLINK(A444),\".aspx\",\"\")&IF(C$1=2013,\"(v=ocs.15).aspx\",\"(v=ocs.14).aspx\"),A444)),\"\")","v":"Remove-CsLisSubnet"},{"$f":"IF(ISTEXT(B444),(HYPERLINK(SUBSTITUTE(HLINK(B444),\".aspx\",\"\")&IF(D$1=2013,\"(v=ocs.15).aspx\",\"(v=ocs.14).aspx\"),B444)),\"\")","v":"Remove-CsLisSubnet"},"Removes a Location Information Server (LIS) subnet.","yes","no","no","yes","no","no","yes","no","no","yes","Get-CsAdminRole | ? {$_.Cmdlets –match \"Remove-CsLisSubnet\"}"]
["Remove-CsLisSwitch","Remove-CsLisSwitch",{"$f":"IF(ISTEXT(A445),(HYPERLINK(SUBSTITUTE(HLINK(A445),\".aspx\",\"\")&IF(C$1=2013,\"(v=ocs.15).aspx\",\"(v=ocs.14).aspx\"),A445)),\"\")","v":"Remove-CsLisSwitch"},{"$f":"IF(ISTEXT(B445),(HYPERLINK(SUBSTITUTE(HLINK(B445),\".aspx\",\"\")&IF(D$1=2013,\"(v=ocs.15).aspx\",\"(v=ocs.14).aspx\"),B445)),\"\")","v":"Remove-CsLisSwitch"},"Removes a Location Information Server (LIS) network switch.","yes","no","no","yes","no","no","yes","no","no","yes",{"$f":"\"Get-CsAdminRole | ? {$_.Cmdlets –match \"& CHAR(34) &B445& CHAR(34) &\"}\"","v":"Get-CsAdminRole | ? {$_.Cmdlets –match \"Remove-CsLisSwitch\"}"}]
["Remove-CsLisWirelessAccessPoint","Remove-CsLisWirelessAccessPoint",{"$f":"IF(ISTEXT(A446),(HYPERLINK(SUBSTITUTE(HLINK(A446),\".aspx\",\"\")&IF(C$1=2013,\"(v=ocs.15).aspx\",\"(v=ocs.14).aspx\"),A446)),\"\")","v":"Remove-CsLisWirelessAccessPoint"},{"$f":"IF(ISTEXT(B446),(HYPERLINK(SUBSTITUTE(HLINK(B446),\".aspx\",\"\")&IF(D$1=2013,\"(v=ocs.15).aspx\",\"(v=ocs.14).aspx\"),B446)),\"\")","v":"Remove-CsLisWirelessAccessPoint"},"Removes a Location Information Server (LIS) wireless access point (WAP).","yes","no","no","yes","no","no","yes","no","no","yes","Get-CsAdminRole | ? {$_.Cmdlets –match \"Remove-CsLisWirelessAccessPoint\"}"]
["Remove-CsLocationPolicy","Remove-CsLocationPolicy",{"$f":"IF(ISTEXT(A447),(HYPERLINK(SUBSTITUTE(HLINK(A447),\".aspx\",\"\")&IF(C$1=2013,\"(v=ocs.15).aspx\",\"(v=ocs.14).aspx\"),A447)),\"\")","v":"Remove-CsLocationPolicy"},{"$f":"IF(ISTEXT(B447),(HYPERLINK(SUBSTITUTE(HLINK(B447),\".aspx\",\"\")&IF(D$1=2013,\"(v=ocs.15).aspx\",\"(v=ocs.14).aspx\"),B447)),\"\")","v":"Remove-CsLocationPolicy"},"Removes the specified location policy. (Location policies are used with the Enhanced 9-1-1 service to enable those who answer 911 calls to determine the caller's geographic location based on the phone number of the telephone or device used to make the call.)","yes","no","no","no","no","no","yes","no","no","yes","Get-CsAdminRole | ? {$_.Cmdlets –match \"Remove-CsLocationPolicy\"}"]
["Remove-CsManagementConnection","Remove-CsManagementConnection",{"$f":"IF(ISTEXT(A448),(HYPERLINK(SUBSTITUTE(HLINK(A448),\".aspx\",\"\")&IF(C$1=2013,\"(v=ocs.15).aspx\",\"(v=ocs.14).aspx\"),A448)),\"\")","v":"Remove-CsManagementConnection"},{"$f":"IF(ISTEXT(B448),(HYPERLINK(SUBSTITUTE(HLINK(B448),\".aspx\",\"\")&IF(D$1=2013,\"(v=ocs.15).aspx\",\"(v=ocs.14).aspx\"),B448)),\"\")","v":"Remove-CsManagementConnection"},"Resets the management connection to the Active Directory service control point for the Central Management store.","yes","no","no","no","no","no","yes","no","no","no","Get-CsAdminRole | ? {$_.Cmdlets –match \"Remove-CsManagementConnection\"}"]
["Remove-CsMcxConfiguration","Remove-CsMcxConfiguration",{"$f":"IF(ISTEXT(A449),(HYPERLINK(SUBSTITUTE(HLINK(A449),\".aspx\",\"\")&IF(C$1=2013,\"(v=ocs.15).aspx\",\"(v=ocs.14).aspx\"),A449)),\"\")","v":"Remove-CsMcxConfiguration"},{"$f":"IF(ISTEXT(B449),(HYPERLINK(SUBSTITUTE(HLINK(B449),\".aspx\",\"\")&IF(D$1=2013,\"(v=ocs.15).aspx\",\"(v=ocs.14).aspx\"),B449)),\"\")","v":"Remove-CsMcxConfiguration"},"Removes the specified collection of Lync Server 2013 Mobility Service configuration settings. The Mobility Service enables users of mobile phones such as iPhones and Windows Phones to do such things as exchange instant messages and presence information; store and retrieve voice mail internally instead of with their wireless provider; and take advantage of Lync Server capabilities such as Call via Work and dial-out conferencing. This cmdlet was introduced in the cumulative update for Lync Server 2010: November 2011.","yes","no","no","no","no","no","yes","no","no","no","Get-CsAdminRole | ? {$_.Cmdlets –match \"Remove-CsMcxConfiguration\"}"]
["Remove-CsMediaConfiguration","Remove-CsMediaConfiguration",{"$f":"IF(ISTEXT(A450),(HYPERLINK(SUBSTITUTE(HLINK(A450),\".aspx\",\"\")&IF(C$1=2013,\"(v=ocs.15).aspx\",\"(v=ocs.14).aspx\"),A450)),\"\")","v":"Remove-CsMediaConfiguration"},{"$f":"IF(ISTEXT(B450),(HYPERLINK(SUBSTITUTE(HLINK(B450),\".aspx\",\"\")&IF(D$1=2013,\"(v=ocs.15).aspx\",\"(v=ocs.14).aspx\"),B450)),\"\")","v":"Remove-CsMediaConfiguration"},"Removes the specified collection of media configuration settings","yes","no","no","no","no","no","yes","no","no","yes","Get-CsAdminRole | ? {$_.Cmdlets –match \"Remove-CsMediaConfiguration\"}"]
["Remove-CsMeetingConfiguration","Remove-CsMeetingConfiguration",{"$f":"IF(ISTEXT(A451),(HYPERLINK(SUBSTITUTE(HLINK(A451),\".aspx\",\"\")&IF(C$1=2013,\"(v=ocs.15).aspx\",\"(v=ocs.14).aspx\"),A451)),\"\")","v":"Remove-CsMeetingConfiguration"},{"$f":"IF(ISTEXT(B451),(HYPERLINK(SUBSTITUTE(HLINK(B451),\".aspx\",\"\")&IF(D$1=2013,\"(v=ocs.15).aspx\",\"(v=ocs.14).aspx\"),B451)),\"\")","v":"Remove-CsMeetingConfiguration"},"Remove-CsMeetingConfiguration enables you to delete an existing collection of meeting configuration settings. Meeting configuration settings help dictate the type of meetings (also called \"conferences\") that users can create, as well as control how (or even if) anonymous users and dial-in conferencing users can join these meetings.","yes","no","no","no","no","no","yes","no","no","no","Get-CsAdminRole | ? {$_.Cmdlets –match \"Remove-CsMeetingConfiguration\"}"]
["Remove-CsMobilityPolicy","Remove-CsMobilityPolicy",{"$f":"IF(ISTEXT(A452),(HYPERLINK(SUBSTITUTE(HLINK(A452),\".aspx\",\"\")&IF(C$1=2013,\"(v=ocs.15).aspx\",\"(v=ocs.14).aspx\"),A452)),\"\")","v":"Remove-CsMobilityPolicy"},{"$f":"IF(ISTEXT(B452),(HYPERLINK(SUBSTITUTE(HLINK(B452),\".aspx\",\"\")&IF(D$1=2013,\"(v=ocs.15).aspx\",\"(v=ocs.14).aspx\"),B452)),\"\")","v":"Remove-CsMobilityPolicy"},"Removes an existing mobility policy. Mobility policies determine whether or not a user can use Call via Work, a feature that enables users to make and receive phone calls on their mobile phone by using their work phone number instead of their mobile phone number. Mobility policies can also be used to require Wi-Fi connections when making or receiving calls. This cmdlet was introduced in the cumulative update for Lync Server 2010: November 2011.","yes","no","no","no","no","no","yes","no","no","no","Get-CsAdminRole | ? {$_.Cmdlets –match \"Remove-CsMobilityPolicy\"}"]
["Remove-CsNetworkBandwidthPolicyProfile","Remove-CsNetworkBandwidthPolicyProfile",{"$f":"IF(ISTEXT(A453),(HYPERLINK(SUBSTITUTE(HLINK(A453),\".aspx\",\"\")&IF(C$1=2013,\"(v=ocs.15).aspx\",\"(v=ocs.14).aspx\"),A453)),\"\")","v":"Remove-CsNetworkBandwidthPolicyProfile"},{"$f":"IF(ISTEXT(B453),(HYPERLINK(SUBSTITUTE(HLINK(B453),\".aspx\",\"\")&IF(D$1=2013,\"(v=ocs.15).aspx\",\"(v=ocs.14).aspx\"),B453)),\"\")","v":"Remove-CsNetworkBandwidthPolicyProfile"},"Removes a network bandwidth policy profile.","yes","no","no","no","no","no","yes","no","no","yes","Get-CsAdminRole | ? {$_.Cmdlets –match \"Remove-CsNetworkBandwidthPolicyProfile\"}"]
["Remove-CsNetworkConfiguration","Remove-CsNetworkConfiguration",{"$f":"IF(ISTEXT(A454),(HYPERLINK(SUBSTITUTE(HLINK(A454),\".aspx\",\"\")&IF(C$1=2013,\"(v=ocs.15).aspx\",\"(v=ocs.14).aspx\"),A454)),\"\")","v":"Remove-CsNetworkConfiguration"},{"$f":"IF(ISTEXT(B454),(HYPERLINK(SUBSTITUTE(HLINK(B454),\".aspx\",\"\")&IF(D$1=2013,\"(v=ocs.15).aspx\",\"(v=ocs.14).aspx\"),B454)),\"\")","v":"Remove-CsNetworkConfiguration"},"Resets all the network configuration settings for a Microsoft Lync Server 2010 deployment to the default values. This deletes an entire call admission control (CAC) deployment and related E9-1-1 configuration.","yes","no","no","no","no","no","yes","no","no","yes","Get-CsAdminRole | ? {$_.Cmdlets –match \"Remove-CsNetworkConfiguration\"}"]
["Remove-CsNetworkInterRegionRoute","Remove-CsNetworkInterRegionRoute",{"$f":"IF(ISTEXT(A455),(HYPERLINK(SUBSTITUTE(HLINK(A455),\".aspx\",\"\")&IF(C$1=2013,\"(v=ocs.15).aspx\",\"(v=ocs.14).aspx\"),A455)),\"\")","v":"Remove-CsNetworkInterRegionRoute"},{"$f":"IF(ISTEXT(B455),(HYPERLINK(SUBSTITUTE(HLINK(B455),\".aspx\",\"\")&IF(D$1=2013,\"(v=ocs.15).aspx\",\"(v=ocs.14).aspx\"),B455)),\"\")","v":"Remove-CsNetworkInterRegionRoute"},"Removes a route that connects network regions within a call admission control (CAC) configuration.","yes","no","no","no","no","no","yes","no","no","yes","Get-CsAdminRole | ? {$_.Cmdlets –match \"Remove-CsNetworkInterRegionRoute\"}"]
["Remove-CsNetworkInterSitePolicy","Remove-CsNetworkInterSitePolicy",{"$f":"IF(ISTEXT(A456),(HYPERLINK(SUBSTITUTE(HLINK(A456),\".aspx\",\"\")&IF(C$1=2013,\"(v=ocs.15).aspx\",\"(v=ocs.14).aspx\"),A456)),\"\")","v":"Remove-CsNetworkInterSitePolicy"},{"$f":"IF(ISTEXT(B456),(HYPERLINK(SUBSTITUTE(HLINK(B456),\".aspx\",\"\")&IF(D$1=2013,\"(v=ocs.15).aspx\",\"(v=ocs.14).aspx\"),B456)),\"\")","v":"Remove-CsNetworkInterSitePolicy"},"Removes a network inter-site policy that defines bandwidth limitations between sites that are directly linked within a call admission control (CAC) configuration.","yes","no","no","no","no","no","yes","no","no","yes","Get-CsAdminRole | ? {$_.Cmdlets –match \"Remove-CsNetworkInterSitePolicy\"}"]
["Remove-CsNetworkRegion","Remove-CsNetworkRegion",{"$f":"IF(ISTEXT(A457),(HYPERLINK(SUBSTITUTE(HLINK(A457),\".aspx\",\"\")&IF(C$1=2013,\"(v=ocs.15).aspx\",\"(v=ocs.14).aspx\"),A457)),\"\")","v":"Remove-CsNetworkRegion"},{"$f":"IF(ISTEXT(B457),(HYPERLINK(SUBSTITUTE(HLINK(B457),\".aspx\",\"\")&IF(D$1=2013,\"(v=ocs.15).aspx\",\"(v=ocs.14).aspx\"),B457)),\"\")","v":"Remove-CsNetworkRegion"},"Removes an existing network region. Network regions represent network hubs or backbones in an enterprise network.","yes","no","no","no","no","no","yes","no","no","yes","Get-CsAdminRole | ? {$_.Cmdlets –match \"Remove-CsNetworkRegion\"}"]
["Remove-CsNetworkRegionLink","Remove-CsNetworkRegionLink",{"$f":"IF(ISTEXT(A458),(HYPERLINK(SUBSTITUTE(HLINK(A458),\".aspx\",\"\")&IF(C$1=2013,\"(v=ocs.15).aspx\",\"(v=ocs.14).aspx\"),A458)),\"\")","v":"Remove-CsNetworkRegionLink"},{"$f":"IF(ISTEXT(B458),(HYPERLINK(SUBSTITUTE(HLINK(B458),\".aspx\",\"\")&IF(D$1=2013,\"(v=ocs.15).aspx\",\"(v=ocs.14).aspx\"),B458)),\"\")","v":"Remove-CsNetworkRegionLink"},"Removes a link between two regions configured for call admission control (CAC).","yes","no","no","no","no","no","yes","no","no","yes","Get-CsAdminRole | ? {$_.Cmdlets –match \"Remove-CsNetworkRegionLink\"}"]
["Remove-CsNetworkSite","Remove-CsNetworkSite",{"$f":"IF(ISTEXT(A459),(HYPERLINK(SUBSTITUTE(HLINK(A459),\".aspx\",\"\")&IF(C$1=2013,\"(v=ocs.15).aspx\",\"(v=ocs.14).aspx\"),A459)),\"\")","v":"Remove-CsNetworkSite"},{"$f":"IF(ISTEXT(B459),(HYPERLINK(SUBSTITUTE(HLINK(B459),\".aspx\",\"\")&IF(D$1=2013,\"(v=ocs.15).aspx\",\"(v=ocs.14).aspx\"),B459)),\"\")","v":"Remove-CsNetworkSite"},"Removes a network site that has been defined for call admission control (CAC) or Enhanced 9-1-1 (E9-1-1).","yes","no","no","yes","no","no","yes","no","no","yes","Get-CsAdminRole | ? {$_.Cmdlets –match \"Remove-CsNetworkSite\"}"]
["Remove-CsNetworkSubnet","Remove-CsNetworkSubnet",{"$f":"IF(ISTEXT(A460),(HYPERLINK(SUBSTITUTE(HLINK(A460),\".aspx\",\"\")&IF(C$1=2013,\"(v=ocs.15).aspx\",\"(v=ocs.14).aspx\"),A460)),\"\")","v":"Remove-CsNetworkSubnet"},{"$f":"IF(ISTEXT(B460),(HYPERLINK(SUBSTITUTE(HLINK(B460),\".aspx\",\"\")&IF(D$1=2013,\"(v=ocs.15).aspx\",\"(v=ocs.14).aspx\"),B460)),\"\")","v":"Remove-CsNetworkSubnet"},"Removes an existing network subnet.","yes","no","no","yes","no","no","yes","no","no","yes","Get-CsAdminRole | ? {$_.Cmdlets –match \"Remove-CsNetworkSubnet\"}"]
[null,"Remove-CsOAuthServer",{"$f":"IF(ISTEXT(A461),(HYPERLINK(SUBSTITUTE(HLINK(A461),\".aspx\",\"\")&IF(C$1=2013,\"(v=ocs.15).aspx\",\"(v=ocs.14).aspx\"),A461)),\"\")","v":""},{"$f":"IF(ISTEXT(B461),(HYPERLINK(SUBSTITUTE(HLINK(B461),\".aspx\",\"\")&IF(D$1=2013,\"(v=ocs.15).aspx\",\"(v=ocs.14).aspx\"),B461)),\"\")","v":"Remove-CsOAuthServer"},"Removes an existing Open Authorization (OAuth) server. OAuth servers, also known as security token servers, issue security tokens used in server-to-server authentication and authorization. This cmdlet was introduced in Lync Server 2013.","yes","no","no","no","no","no","yes","no","no","no","Get-CsAdminRole | ? {$_.Cmdlets –match \"Remove-CsOAuthServer\"}"]
[null,"Remove-CsOutboundCallingNumberTranslationRule",{"$f":"IF(ISTEXT(A462),(HYPERLINK(SUBSTITUTE(HLINK(A462),\".aspx\",\"\")&IF(C$1=2013,\"(v=ocs.15).aspx\",\"(v=ocs.14).aspx\"),A462)),\"\")","v":""},{"$f":"IF(ISTEXT(B462),(HYPERLINK(SUBSTITUTE(HLINK(B462),\".aspx\",\"\")&IF(D$1=2013,\"(v=ocs.15).aspx\",\"(v=ocs.14).aspx\"),B462)),\"\")","v":"Remove-CsOutboundCallingNumberTranslationRule"},"Removes an existing outbound calling number translation rule. An outbound calling number translation rule converts the E.164 phone numbers used by Lync Server 2013 to a format that can be used by trunking peers that do not support E.164 numbers. This cmdlet was introduced in Lync Server 2013.","yes","no","no","no","no","no","yes","no","no","yes","Get-CsAdminRole | ? {$_.Cmdlets –match \"Remove-CsOutboundCallingNumberTranslationRule\"}"]
["Remove-CsOutboundTranslationRule","Remove-CsOutboundTranslationRule",{"$f":"IF(ISTEXT(A463),(HYPERLINK(SUBSTITUTE(HLINK(A463),\".aspx\",\"\")&IF(C$1=2013,\"(v=ocs.15).aspx\",\"(v=ocs.14).aspx\"),A463)),\"\")","v":"Remove-CsOutboundTranslationRule"},{"$f":"IF(ISTEXT(B463),(HYPERLINK(SUBSTITUTE(HLINK(B463),\".aspx\",\"\")&IF(D$1=2013,\"(v=ocs.15).aspx\",\"(v=ocs.14).aspx\"),B463)),\"\")","v":"Remove-CsOutboundTranslationRule"},"Removes an existing outbound translation rule. An outbound translation rule converts phone numbers to the local dialing format for interaction with private branch exchange (PBX) systems.","yes","no","no","no","no","no","yes","no","no","yes","Get-CsAdminRole | ? {$_.Cmdlets –match \"Remove-CsOutboundTranslationRule\"}"]
[null,"Remove-CsPartnerApplication",{"$f":"IF(ISTEXT(A464),(HYPERLINK(SUBSTITUTE(HLINK(A464),\".aspx\",\"\")&IF(C$1=2013,\"(v=ocs.15).aspx\",\"(v=ocs.14).aspx\"),A464)),\"\")","v":""},{"$f":"IF(ISTEXT(B464),(HYPERLINK(SUBSTITUTE(HLINK(B464),\".aspx\",\"\")&IF(D$1=2013,\"(v=ocs.15).aspx\",\"(v=ocs.14).aspx\"),B464)),\"\")","v":"Remove-CsPartnerApplication"},"Removes an existing partner application. A partner application is any application that Lync Server 2013 can directly exchange security tokens with, without having to go through a third-party security token server. This cmdlet was introduced in Lync Server 2013.","yes","no","no","no","no","no","yes","no","no","no","Get-CsAdminRole | ? {$_.Cmdlets –match \"Remove-CsPartnerApplication\"}"]
[null,"Remove-CsPersistentChatAddin",{"$f":"IF(ISTEXT(A465),(HYPERLINK(SUBSTITUTE(HLINK(A465),\".aspx\",\"\")&IF(C$1=2013,\"(v=ocs.15).aspx\",\"(v=ocs.14).aspx\"),A465)),\"\")","v":""},{"$f":"IF(ISTEXT(B465),(HYPERLINK(SUBSTITUTE(HLINK(B465),\".aspx\",\"\")&IF(D$1=2013,\"(v=ocs.15).aspx\",\"(v=ocs.14).aspx\"),B465)),\"\")","v":"Remove-CsPersistentChatAddin"},"Removes an existing Persistent Chat add-in. A Persistent Chat add-in is a customized web page that can be embedded within a Persistent Chat client. This cmdlet was introduced in Lync Server 2013.","yes","no","no","no","yes","no","yes","no","no","no","Get-CsAdminRole | ? {$_.Cmdlets –match \"Remove-CsPersistentChatAddin\"}"]
[null,"Remove-CsPersistentChatCategory",{"$f":"IF(ISTEXT(A466),(HYPERLINK(SUBSTITUTE(HLINK(A466),\".aspx\",\"\")&IF(C$1=2013,\"(v=ocs.15).aspx\",\"(v=ocs.14).aspx\"),A466)),\"\")","v":""},{"$f":"IF(ISTEXT(B466),(HYPERLINK(SUBSTITUTE(HLINK(B466),\".aspx\",\"\")&IF(D$1=2013,\"(v=ocs.15).aspx\",\"(v=ocs.14).aspx\"),B466)),\"\")","v":"Remove-CsPersistentChatCategory"},"Removes an existing Persistent Chat category. A Persistent Chat category represents a collection of Persistent Chat chat rooms, and each chat room must be associated with a category. This cmdlet was introduced in Lync Server 2013. Note that categories cannot be removed unless they are empty (that is, all the rooms within that category must be removed before you can remove the category).","yes","no","no","no","yes","no","yes","no","no","no","Get-CsAdminRole | ? {$_.Cmdlets –match \"Remove-CsPersistentChatCategory\"}"]
[null,"Remove-CsPersistentChatComplianceConfiguration",{"$f":"IF(ISTEXT(A467),(HYPERLINK(SUBSTITUTE(HLINK(A467),\".aspx\",\"\")&IF(C$1=2013,\"(v=ocs.15).aspx\",\"(v=ocs.14).aspx\"),A467)),\"\")","v":""},{"$f":"IF(ISTEXT(B467),(HYPERLINK(SUBSTITUTE(HLINK(B467),\".aspx\",\"\")&IF(D$1=2013,\"(v=ocs.15).aspx\",\"(v=ocs.14).aspx\"),B467)),\"\")","v":"Remove-CsPersistentChatComplianceConfiguration"},"Removes an existing collection of Persistent Chat compliance configuration settings. Persistent Chat compliance enables administrators to maintain an archive of Persistent Chat items and activities including: new messages; new events (for example, a user entering or existing a chat room); file uploads and downloads; and searches run against the chat history. This cmdlet was introduced in Lync Server 2013.","yes","yes","no","no","yes","no","yes","no","no","no","Get-CsAdminRole | ? {$_.Cmdlets –match \"Remove-CsPersistentChatComplianceConfiguration\"}"]
[null,"Remove-CsPersistentChatConfiguration",{"$f":"IF(ISTEXT(A468),(HYPERLINK(SUBSTITUTE(HLINK(A468),\".aspx\",\"\")&IF(C$1=2013,\"(v=ocs.15).aspx\",\"(v=ocs.14).aspx\"),A468)),\"\")","v":""},{"$f":"IF(ISTEXT(B468),(HYPERLINK(SUBSTITUTE(HLINK(B468),\".aspx\",\"\")&IF(D$1=2013,\"(v=ocs.15).aspx\",\"(v=ocs.14).aspx\"),B468)),\"\")","v":"Remove-CsPersistentChatConfiguration"},"Removes an existing collection of Persistent Chat configuration settings. Persistent Chat configuration settings are used to manage the Persistent Chat service. For example, these settings allow you to specify the maximum number of users who can participate in a chat room. This cmdlet was introduced in Lync Server 2013.","yes","no","no","no","yes","no","yes","no","no","no","Get-CsAdminRole | ? {$_.Cmdlets –match \"Remove-CsPersistentChatConfiguration\"}"]
[null,"Remove-CsPersistentChatEndpoint",{"$f":"IF(ISTEXT(A469),(HYPERLINK(SUBSTITUTE(HLINK(A469),\".aspx\",\"\")&IF(C$1=2013,\"(v=ocs.15).aspx\",\"(v=ocs.14).aspx\"),A469)),\"\")","v":""},{"$f":"IF(ISTEXT(B469),(HYPERLINK(SUBSTITUTE(HLINK(B469),\".aspx\",\"\")&IF(D$1=2013,\"(v=ocs.15).aspx\",\"(v=ocs.14).aspx\"),B469)),\"\")","v":"Remove-CsPersistentChatEndpoint"},"Removes an existing Persistent Chat endpoint. A Persistent Chat endpoint is an Active Directory contact object provides a friendly URL for a Lync Server 2013 Persistent Chat pool. This cmdlet was introduced in Lync Server 2013.","yes","no","no","no","yes","no","yes","no","no","no","Get-CsAdminRole | ? {$_.Cmdlets –match \"Remove-CsPersistentChatEndpoint\"}"]
[null,"Remove-CsPersistentChatMessage",{"$f":"IF(ISTEXT(A470),(HYPERLINK(SUBSTITUTE(HLINK(A470),\".aspx\",\"\")&IF(C$1=2013,\"(v=ocs.15).aspx\",\"(v=ocs.14).aspx\"),A470)),\"\")","v":""},{"$f":"IF(ISTEXT(B470),(HYPERLINK(SUBSTITUTE(HLINK(B470),\".aspx\",\"\")&IF(D$1=2013,\"(v=ocs.15).aspx\",\"(v=ocs.14).aspx\"),B470)),\"\")","v":"Remove-CsPersistentChatMessage"},"Replaces one or more Persistent Chat messages in the Persistent Chat database with a default message or with an administrator-provided message. This cmdlet was introduced in Lync Server 2013.","yes","no","no","no","yes","no","yes","no","no","no","Get-CsAdminRole | ? {$_.Cmdlets –match \"Remove-CsPersistentChatMessage\"}"]
[null,"Remove-CsPersistentChatPolicy",{"$f":"IF(ISTEXT(A471),(HYPERLINK(SUBSTITUTE(HLINK(A471),\".aspx\",\"\")&IF(C$1=2013,\"(v=ocs.15).aspx\",\"(v=ocs.14).aspx\"),A471)),\"\")","v":""},{"$f":"IF(ISTEXT(B471),(HYPERLINK(SUBSTITUTE(HLINK(B471),\".aspx\",\"\")&IF(D$1=2013,\"(v=ocs.15).aspx\",\"(v=ocs.14).aspx\"),B471)),\"\")","v":"Remove-CsPersistentChatPolicy"},"Removes an existing Persistent Chat policy. Persistent Chat policies determine whether or not users are allowed access to Persistent Chat chat rooms. This cmdlet was introduced in Lync Server 2013.","yes","no","no","no","yes","no","yes","no","no","no","Get-CsAdminRole | ? {$_.Cmdlets –match \"Remove-CsPersistentChatPolicy\"}"]
[null,"Remove-CsPersistentChatRoom",{"$f":"IF(ISTEXT(A472),(HYPERLINK(SUBSTITUTE(HLINK(A472),\".aspx\",\"\")&IF(C$1=2013,\"(v=ocs.15).aspx\",\"(v=ocs.14).aspx\"),A472)),\"\")","v":""},{"$f":"IF(ISTEXT(B472),(HYPERLINK(SUBSTITUTE(HLINK(B472),\".aspx\",\"\")&IF(D$1=2013,\"(v=ocs.15).aspx\",\"(v=ocs.14).aspx\"),B472)),\"\")","v":"Remove-CsPersistentChatRoom"},"Removes one or more Persistent Chat chat rooms. A chat room is a discussion forum that typically revolves around a specific topic. This cmdlet was introduced in Lync Server 2013.","yes","no","no","no","yes","no","yes","no","no","no","Get-CsAdminRole | ? {$_.Cmdlets –match \"Remove-CsPersistentChatRoom\"}"]
["Remove-CsPinPolicy","Remove-CsPinPolicy",{"$f":"IF(ISTEXT(A473),(HYPERLINK(SUBSTITUTE(HLINK(A473),\".aspx\",\"\")&IF(C$1=2013,\"(v=ocs.15).aspx\",\"(v=ocs.14).aspx\"),A473)),\"\")","v":"Remove-CsPinPolicy"},{"$f":"IF(ISTEXT(B473),(HYPERLINK(SUBSTITUTE(HLINK(B473),\".aspx\",\"\")&IF(D$1=2013,\"(v=ocs.15).aspx\",\"(v=ocs.14).aspx\"),B473)),\"\")","v":"Remove-CsPinPolicy"},"Removes the specified personal identification number (PIN) policy. PIN authentication and PIN policies enable users to access Microsoft Lync Server 2010 by providing a PIN instead of a user name and password.","yes","no","no","no","no","no","yes","no","no","no","Get-CsAdminRole | ? {$_.Cmdlets –match \"Remove-CsPinPolicy\"}"]
["Remove-CsPresencePolicy","Remove-CsPresencePolicy",{"$f":"IF(ISTEXT(A474),(HYPERLINK(SUBSTITUTE(HLINK(A474),\".aspx\",\"\")&IF(C$1=2013,\"(v=ocs.15).aspx\",\"(v=ocs.14).aspx\"),A474)),\"\")","v":"Remove-CsPresencePolicy"},{"$f":"IF(ISTEXT(B474),(HYPERLINK(SUBSTITUTE(HLINK(B474),\".aspx\",\"\")&IF(D$1=2013,\"(v=ocs.15).aspx\",\"(v=ocs.14).aspx\"),B474)),\"\")","v":"Remove-CsPresencePolicy"},"Removes the specified presence policy.","yes","no","no","no","no","no","yes","no","no","no","Get-CsAdminRole | ? {$_.Cmdlets –match \"Remove-CsPresencePolicy\"}"]
[null,"Remove-CsPresenceProvider",{"$f":"IF(ISTEXT(A475),(HYPERLINK(SUBSTITUTE(HLINK(A475),\".aspx\",\"\")&IF(C$1=2013,\"(v=ocs.15).aspx\",\"(v=ocs.14).aspx\"),A475)),\"\")","v":""},{"$f":"IF(ISTEXT(B475),(HYPERLINK(SUBSTITUTE(HLINK(B475),\".aspx\",\"\")&IF(D$1=2013,\"(v=ocs.15).aspx\",\"(v=ocs.14).aspx\"),B475)),\"\")","v":"Remove-CsPresenceProvider"},"Removes a presence provider previously configured for use in the organization. Presence providers represent the PresenceProviders property of a collection of user services configuration settings. This cmdlet was introduced in Lync Server 2013.","yes","no","no","no","no","no","yes","no","no","no","Get-CsAdminRole | ? {$_.Cmdlets –match \"Remove-CsPresenceProvider\"}"]
["Remove-CsPrivacyConfiguration","Remove-CsPrivacyConfiguration",{"$f":"IF(ISTEXT(A476),(HYPERLINK(SUBSTITUTE(HLINK(A476),\".aspx\",\"\")&IF(C$1=2013,\"(v=ocs.15).aspx\",\"(v=ocs.14).aspx\"),A476)),\"\")","v":"Remove-CsPrivacyConfiguration"},{"$f":"IF(ISTEXT(B476),(HYPERLINK(SUBSTITUTE(HLINK(B476),\".aspx\",\"\")&IF(D$1=2013,\"(v=ocs.15).aspx\",\"(v=ocs.14).aspx\"),B476)),\"\")","v":"Remove-CsPrivacyConfiguration"},"Removes an existing collection of privacy configuration settings. Privacy configuration settings help determine how much information users make available to other users.","yes","no","no","no","no","no","yes","no","no","no","Get-CsAdminRole | ? {$_.Cmdlets –match \"Remove-CsPrivacyConfiguration\"}"]
["Remove-CsProxyConfiguration","Remove-CsProxyConfiguration",{"$f":"IF(ISTEXT(A477),(HYPERLINK(SUBSTITUTE(HLINK(A477),\".aspx\",\"\")&IF(C$1=2013,\"(v=ocs.15).aspx\",\"(v=ocs.14).aspx\"),A477)),\"\")","v":"Remove-CsProxyConfiguration"},{"$f":"IF(ISTEXT(B477),(HYPERLINK(SUBSTITUTE(HLINK(B477),\".aspx\",\"\")&IF(D$1=2013,\"(v=ocs.15).aspx\",\"(v=ocs.14).aspx\"),B477)),\"\")","v":"Remove-CsProxyConfiguration"},"Removes an existing collection of proxy server configuration settings.","yes","no","no","no","no","no","yes","no","no","no",{"$f":"\"Get-CsAdminRole | ? {$_.Cmdlets –match \"& CHAR(34) &B477& CHAR(34) &\"}\"","v":"Get-CsAdminRole | ? {$_.Cmdlets –match \"Remove-CsProxyConfiguration\"}"}]
["Remove-CsPublicProvider","Remove-CsPublicProvider",{"$f":"IF(ISTEXT(A478),(HYPERLINK(SUBSTITUTE(HLINK(A478),\".aspx\",\"\")&IF(C$1=2013,\"(v=ocs.15).aspx\",\"(v=ocs.14).aspx\"),A478)),\"\")","v":"Remove-CsPublicProvider"},{"$f":"IF(ISTEXT(B478),(HYPERLINK(SUBSTITUTE(HLINK(B478),\".aspx\",\"\")&IF(D$1=2013,\"(v=ocs.15).aspx\",\"(v=ocs.14).aspx\"),B478)),\"\")","v":"Remove-CsPublicProvider"},"Removes a public provider configured for use in your organization. A public provider is an organization that provides instant messaging (IM), presence, and related services to the general public. Microsoft Lync Server 2010 ships with three public providers configured but not enabled: Yahoo!; AOL; and MSN.","yes","no","no","no","no","no","yes","no","no","no","Get-CsAdminRole | ? {$_.Cmdlets –match \"Remove-CsPublicProvider\"}"]
["Remove-CsPushNotificationConfiguration","Remove-CsPushNotificationConfiguration",{"$f":"IF(ISTEXT(A479),(HYPERLINK(SUBSTITUTE(HLINK(A479),\".aspx\",\"\")&IF(C$1=2013,\"(v=ocs.15).aspx\",\"(v=ocs.14).aspx\"),A479)),\"\")","v":"Remove-CsPushNotificationConfiguration"},{"$f":"IF(ISTEXT(B479),(HYPERLINK(SUBSTITUTE(HLINK(B479),\".aspx\",\"\")&IF(D$1=2013,\"(v=ocs.15).aspx\",\"(v=ocs.14).aspx\"),B479)),\"\")","v":"Remove-CsPushNotificationConfiguration"},"Deletes an existing collection of push notification settings. The push notification service (Apple Push Notification Service and Microsoft Push Notification Service) provides a way to send notifications about events such as new instant messages or new voice mail to mobile devices such as iPhones and Windows Phones, even if the Lync application on those devices is currently suspended or running in the background. This cmdlet was introduced in the cumulative update for Lync Server 2010: November 2011.","yes","no","no","no","no","no","yes","no","no","no","Get-CsAdminRole | ? {$_.Cmdlets –match \"Remove-CsPushNotificationConfiguration\"}"]
["Remove-CsQoEConfiguration","Remove-CsQoEConfiguration",{"$f":"IF(ISTEXT(A480),(HYPERLINK(SUBSTITUTE(HLINK(A480),\".aspx\",\"\")&IF(C$1=2013,\"(v=ocs.15).aspx\",\"(v=ocs.14).aspx\"),A480)),\"\")","v":"Remove-CsQoEConfiguration"},{"$f":"IF(ISTEXT(B480),(HYPERLINK(SUBSTITUTE(HLINK(B480),\".aspx\",\"\")&IF(D$1=2013,\"(v=ocs.15).aspx\",\"(v=ocs.14).aspx\"),B480)),\"\")","v":"Remove-CsQoEConfiguration"},"Removes a collection of QoE (Quality of Experience) settings.","yes","no","no","no","no","no","yes","no","no","yes","Get-CsAdminRole | ? {$_.Cmdlets –match \"Remove-CsQoEConfiguration\"}"]
["Remove-CsRegistrarConfiguration","Remove-CsRegistrarConfiguration",{"$f":"IF(ISTEXT(A481),(HYPERLINK(SUBSTITUTE(HLINK(A481),\".aspx\",\"\")&IF(C$1=2013,\"(v=ocs.15).aspx\",\"(v=ocs.14).aspx\"),A481)),\"\")","v":"Remove-CsRegistrarConfiguration"},{"$f":"IF(ISTEXT(B481),(HYPERLINK(SUBSTITUTE(HLINK(B481),\".aspx\",\"\")&IF(D$1=2013,\"(v=ocs.15).aspx\",\"(v=ocs.14).aspx\"),B481)),\"\")","v":"Remove-CsRegistrarConfiguration"},"Removes an existing collection of Registrar configuration settings. Registrars are used to authenticate logon requests and to maintain information about user status and availability.","yes","no","no","no","no","no","yes","no","no","no","Get-CsAdminRole | ? {$_.Cmdlets –match \"Remove-CsRegistrarConfiguration\"}"]
[null,"Remove-CsReportingConfiguration",{"$f":"IF(ISTEXT(A482),(HYPERLINK(SUBSTITUTE(HLINK(A482),\".aspx\",\"\")&IF(C$1=2013,\"(v=ocs.15).aspx\",\"(v=ocs.14).aspx\"),A482)),\"\")","v":""},{"$f":"IF(ISTEXT(B482),(HYPERLINK(SUBSTITUTE(HLINK(B482),\".aspx\",\"\")&IF(D$1=2013,\"(v=ocs.15).aspx\",\"(v=ocs.14).aspx\"),B482)),\"\")","v":"Remove-CsReportingConfiguration"},"Removes an existing collection of reporting configuration settings. Reporting configuration settings are used to specify the URL for installations of Lync Server 2013 Monitoring Reports. This cmdlet was introduced in Lync Server 2013.","yes","no","no","no","no","no","yes","no","no","no","Get-CsAdminRole | ? {$_.Cmdlets –match \"Remove-CsReportingConfiguration\"}"]
["Remove-CsRgsAgentGroup","Remove-CsRgsAgentGroup",{"$f":"IF(ISTEXT(A483),(HYPERLINK(SUBSTITUTE(HLINK(A483),\".aspx\",\"\")&IF(C$1=2013,\"(v=ocs.15).aspx\",\"(v=ocs.14).aspx\"),A483)),\"\")","v":"Remove-CsRgsAgentGroup"},{"$f":"IF(ISTEXT(B483),(HYPERLINK(SUBSTITUTE(HLINK(B483),\".aspx\",\"\")&IF(D$1=2013,\"(v=ocs.15).aspx\",\"(v=ocs.14).aspx\"),B483)),\"\")","v":"Remove-CsRgsAgentGroup"},"Removes an existing Response Group agent group. An agent group is a collection of agents assigned to a Response Group queue. Agents are the users assigned to answer calls directed to a particular queue.","yes","no","no","no","no","yes","yes","no","no","yes","Get-CsAdminRole | ? {$_.Cmdlets –match \"Remove-CsRgsAgentGroup\"}"]
["Remove-CsRgsHolidaySet","Remove-CsRgsHolidaySet",{"$f":"IF(ISTEXT(A484),(HYPERLINK(SUBSTITUTE(HLINK(A484),\".aspx\",\"\")&IF(C$1=2013,\"(v=ocs.15).aspx\",\"(v=ocs.14).aspx\"),A484)),\"\")","v":"Remove-CsRgsHolidaySet"},{"$f":"IF(ISTEXT(B484),(HYPERLINK(SUBSTITUTE(HLINK(B484),\".aspx\",\"\")&IF(D$1=2013,\"(v=ocs.15).aspx\",\"(v=ocs.14).aspx\"),B484)),\"\")","v":"Remove-CsRgsHolidaySet"},"Removes an existing Response Group holiday set. A Response Group holiday set is a collection of holidays. For example, you might have one holiday set for a United States (U.S.)-based queue (a set which might include a holiday for the Fourth of July) and a different set for a queue based in France. The latter queue might define a holiday for Bastille Day but not for the Fourth of July.","yes","no","no","no","no","yes","yes","no","no","yes","Get-CsAdminRole | ? {$_.Cmdlets –match \"Remove-CsRgsHolidaySet\"}"]
["Remove-CsRgsHoursOfBusiness","Remove-CsRgsHoursOfBusiness",{"$f":"IF(ISTEXT(A485),(HYPERLINK(SUBSTITUTE(HLINK(A485),\".aspx\",\"\")&IF(C$1=2013,\"(v=ocs.15).aspx\",\"(v=ocs.14).aspx\"),A485)),\"\")","v":"Remove-CsRgsHoursOfBusiness"},{"$f":"IF(ISTEXT(B485),(HYPERLINK(SUBSTITUTE(HLINK(B485),\".aspx\",\"\")&IF(D$1=2013,\"(v=ocs.15).aspx\",\"(v=ocs.14).aspx\"),B485)),\"\")","v":"Remove-CsRgsHoursOfBusiness"},"Removes an existing set of Response Group business hours. Business hours are used to indicate the days of the week and the times of day when Response Group agents are typically available to answer phone calls.","yes","no","no","no","no","yes","yes","no","no","yes","Get-CsAdminRole | ? {$_.Cmdlets –match \"Remove-CsRgsHoursOfBusiness\"}"]
["Remove-CsRgsQueue","Remove-CsRgsQueue",{"$f":"IF(ISTEXT(A486),(HYPERLINK(SUBSTITUTE(HLINK(A486),\".aspx\",\"\")&IF(C$1=2013,\"(v=ocs.15).aspx\",\"(v=ocs.14).aspx\"),A486)),\"\")","v":"Remove-CsRgsQueue"},{"$f":"IF(ISTEXT(B486),(HYPERLINK(SUBSTITUTE(HLINK(B486),\".aspx\",\"\")&IF(D$1=2013,\"(v=ocs.15).aspx\",\"(v=ocs.14).aspx\"),B486)),\"\")","v":"Remove-CsRgsQueue"},"Deletes an existing Response Group queue. With the Response Group application, phone calls are put in a queue and callers are placed on hold until a Response Group agent is available to answer that call.","yes","no","no","no","no","yes","yes","no","no","yes","Get-CsAdminRole | ? {$_.Cmdlets –match \"Remove-CsRgsQueue\"}"]
["Remove-CsRgsWorkflow","Remove-CsRgsWorkflow",{"$f":"IF(ISTEXT(A487),(HYPERLINK(SUBSTITUTE(HLINK(A487),\".aspx\",\"\")&IF(C$1=2013,\"(v=ocs.15).aspx\",\"(v=ocs.14).aspx\"),A487)),\"\")","v":"Remove-CsRgsWorkflow"},{"$f":"IF(ISTEXT(B487),(HYPERLINK(SUBSTITUTE(HLINK(B487),\".aspx\",\"\")&IF(D$1=2013,\"(v=ocs.15).aspx\",\"(v=ocs.14).aspx\"),B487)),\"\")","v":"Remove-CsRgsWorkflow"},"Deletes an existing Response Group workflow. Workflows determine the actions that are taken when the Response Group application receives a phone call.","yes","no","no","no","no","yes","yes","no","no","yes","Get-CsAdminRole | ? {$_.Cmdlets –match \"Remove-CsRgsWorkflow\"}"]
["Remove-CsRoutingConfiguration","Remove-CsRoutingConfiguration",{"$f":"IF(ISTEXT(A488),(HYPERLINK(SUBSTITUTE(HLINK(A488),\".aspx\",\"\")&IF(C$1=2013,\"(v=ocs.15).aspx\",\"(v=ocs.14).aspx\"),A488)),\"\")","v":"Remove-CsRoutingConfiguration"},{"$f":"IF(ISTEXT(B488),(HYPERLINK(SUBSTITUTE(HLINK(B488),\".aspx\",\"\")&IF(D$1=2013,\"(v=ocs.15).aspx\",\"(v=ocs.14).aspx\"),B488)),\"\")","v":"Remove-CsRoutingConfiguration"},"Resets the routing configuration to its default settings.","yes","no","no","no","no","no","yes","no","no","yes","Get-CsAdminRole | ? {$_.Cmdlets –match \"Remove-CsRoutingConfiguration\"}"]
["Remove-CsServerApplication","Remove-CsServerApplication",{"$f":"IF(ISTEXT(A489),(HYPERLINK(SUBSTITUTE(HLINK(A489),\".aspx\",\"\")&IF(C$1=2013,\"(v=ocs.15).aspx\",\"(v=ocs.14).aspx\"),A489)),\"\")","v":"Remove-CsServerApplication"},{"$f":"IF(ISTEXT(B489),(HYPERLINK(SUBSTITUTE(HLINK(B489),\".aspx\",\"\")&IF(D$1=2013,\"(v=ocs.15).aspx\",\"(v=ocs.14).aspx\"),B489)),\"\")","v":"Remove-CsServerApplication"},"Removes an existing server application. Server applications are applications that are hosted by Microsoft Lync Server 2010.","yes","no","no","no","no","no","yes","no","no","no","Get-CsAdminRole | ? {$_.Cmdlets –match \"Remove-CsServerApplication\"}"]
["Remove-CsSimpleUrlConfiguration","Remove-CsSimpleUrlConfiguration",{"$f":"IF(ISTEXT(A490),(HYPERLINK(SUBSTITUTE(HLINK(A490),\".aspx\",\"\")&IF(C$1=2013,\"(v=ocs.15).aspx\",\"(v=ocs.14).aspx\"),A490)),\"\")","v":"Remove-CsSimpleUrlConfiguration"},{"$f":"IF(ISTEXT(B490),(HYPERLINK(SUBSTITUTE(HLINK(B490),\".aspx\",\"\")&IF(D$1=2013,\"(v=ocs.15).aspx\",\"(v=ocs.14).aspx\"),B490)),\"\")","v":"Remove-CsSimpleUrlConfiguration"},"Removes one or more of the simple URL configuration collections currently in use in your organization. Simple URLs make it easier for users to join meetings and conferences, as well as making it easier for Administrators to log on to the Microsoft Lync Server 2010 Control Panel.","yes","no","no","no","no","no","yes","no","no","no","Get-CsAdminRole | ? {$_.Cmdlets –match \"Remove-CsSimpleUrlConfiguration\"}"]
["Remove-CsSipDomain","Remove-CsSipDomain",{"$f":"IF(ISTEXT(A491),(HYPERLINK(SUBSTITUTE(HLINK(A491),\".aspx\",\"\")&IF(C$1=2013,\"(v=ocs.15).aspx\",\"(v=ocs.14).aspx\"),A491)),\"\")","v":"Remove-CsSipDomain"},{"$f":"IF(ISTEXT(B491),(HYPERLINK(SUBSTITUTE(HLINK(B491),\".aspx\",\"\")&IF(D$1=2013,\"(v=ocs.15).aspx\",\"(v=ocs.14).aspx\"),B491)),\"\")","v":"Remove-CsSipDomain"},"Removes a SIP domain previously configured for use in your organization. SIP domains are domains authorized to send and receive SIP traffic, and are used when assigning SIP addresses to users.","yes","no","no","no","no","no","yes","no","no","no","Get-CsAdminRole | ? {$_.Cmdlets –match \"Remove-CsSipDomain\"}"]
["Remove-CsSipResponseCodeTranslationRule","Remove-CsSipResponseCodeTranslationRule",{"$f":"IF(ISTEXT(A492),(HYPERLINK(SUBSTITUTE(HLINK(A492),\".aspx\",\"\")&IF(C$1=2013,\"(v=ocs.15).aspx\",\"(v=ocs.14).aspx\"),A492)),\"\")","v":"Remove-CsSipResponseCodeTranslationRule"},{"$f":"IF(ISTEXT(B492),(HYPERLINK(SUBSTITUTE(HLINK(B492),\".aspx\",\"\")&IF(D$1=2013,\"(v=ocs.15).aspx\",\"(v=ocs.14).aspx\"),B492)),\"\")","v":"Remove-CsSipResponseCodeTranslationRule"},"Removes a SIP response code translation rule. These rules enable administrators to map SIP response codes with values between 400 and 699 to the values used by Microsoft Lync Server 2010.","yes","no","no","no","no","no","yes","no","no","yes","Get-CsAdminRole | ? {$_.Cmdlets –match \"Remove-CsSipResponseCodeTranslationRule\"}"]
["Remove-CsStaticRoutingConfiguration","Remove-CsStaticRoutingConfiguration",{"$f":"IF(ISTEXT(A493),(HYPERLINK(SUBSTITUTE(HLINK(A493),\".aspx\",\"\")&IF(C$1=2013,\"(v=ocs.15).aspx\",\"(v=ocs.14).aspx\"),A493)),\"\")","v":"Remove-CsStaticRoutingConfiguration"},{"$f":"IF(ISTEXT(B493),(HYPERLINK(SUBSTITUTE(HLINK(B493),\".aspx\",\"\")&IF(D$1=2013,\"(v=ocs.15).aspx\",\"(v=ocs.14).aspx\"),B493)),\"\")","v":"Remove-CsStaticRoutingConfiguration"},"Removes the specified collection of static routing configuration settings.","yes","no","no","no","no","no","yes","no","no","no","Get-CsAdminRole | ? {$_.Cmdlets –match \"Remove-CsStaticRoutingConfiguration\"}"]
["Remove-CsTestDevice","Remove-CsTestDevice",{"$f":"IF(ISTEXT(A494),(HYPERLINK(SUBSTITUTE(HLINK(A494),\".aspx\",\"\")&IF(C$1=2013,\"(v=ocs.15).aspx\",\"(v=ocs.14).aspx\"),A494)),\"\")","v":"Remove-CsTestDevice"},{"$f":"IF(ISTEXT(B494),(HYPERLINK(SUBSTITUTE(HLINK(B494),\".aspx\",\"\")&IF(D$1=2013,\"(v=ocs.15).aspx\",\"(v=ocs.14).aspx\"),B494)),\"\")","v":"Remove-CsTestDevice"},"Removes the specified device update management test device. Test devices provide a way for administrators to test firmware updates before those updates are distributed to all the devices in an organization.","yes","no","no","no","no","no","yes","no","no","yes","Get-CsAdminRole | ? {$_.Cmdlets –match \"Remove-CsTestDevice\"}"]
[null,"Remove-CsTestUserCredential",{"$f":"IF(ISTEXT(A495),(HYPERLINK(SUBSTITUTE(HLINK(A495),\".aspx\",\"\")&IF(C$1=2013,\"(v=ocs.15).aspx\",\"(v=ocs.14).aspx\"),A495)),\"\")","v":""},{"$f":"IF(ISTEXT(B495),(HYPERLINK(SUBSTITUTE(HLINK(B495),\".aspx\",\"\")&IF(D$1=2013,\"(v=ocs.15).aspx\",\"(v=ocs.14).aspx\"),B495)),\"\")","v":"Remove-CsTestUserCredential"},"Removes the specified user from the set of users configured as watcher node test users. Watcher nodes are computers that periodically use Microsoft System Center Operations Manager and Lync Server 2013 synthetic transactions to verify that Lync Server components are working as expected. This cmdlet was introduced in Lync Server 2013.","no","no","no","no","no","no","no","no","no","no","Get-CsAdminRole | ? {$_.Cmdlets –match \"Remove-CsTestUserCredential\"}"]
["Remove-CsTrunkConfiguration","Remove-CsTrunkConfiguration",{"$f":"IF(ISTEXT(A496),(HYPERLINK(SUBSTITUTE(HLINK(A496),\".aspx\",\"\")&IF(C$1=2013,\"(v=ocs.15).aspx\",\"(v=ocs.14).aspx\"),A496)),\"\")","v":"Remove-CsTrunkConfiguration"},{"$f":"IF(ISTEXT(B496),(HYPERLINK(SUBSTITUTE(HLINK(B496),\".aspx\",\"\")&IF(D$1=2013,\"(v=ocs.15).aspx\",\"(v=ocs.14).aspx\"),B496)),\"\")","v":"Remove-CsTrunkConfiguration"},"Removes an existing trunk configuration that describes the settings for a trunking peer entity such as a public switched telephone network (PSTN) gateway, IP-public branch exchange (PBX), or Session Border Controller (SBC) at the service provider.","yes","no","no","no","no","no","yes","no","no","yes","Get-CsAdminRole | ? {$_.Cmdlets –match \"Remove-CsTrunkConfiguration\"}"]
["Remove-CsTrustedApplication","Remove-CsTrustedApplication",{"$f":"IF(ISTEXT(A497),(HYPERLINK(SUBSTITUTE(HLINK(A497),\".aspx\",\"\")&IF(C$1=2013,\"(v=ocs.15).aspx\",\"(v=ocs.14).aspx\"),A497)),\"\")","v":"Remove-CsTrustedApplication"},{"$f":"IF(ISTEXT(B497),(HYPERLINK(SUBSTITUTE(HLINK(B497),\".aspx\",\"\")&IF(D$1=2013,\"(v=ocs.15).aspx\",\"(v=ocs.14).aspx\"),B497)),\"\")","v":"Remove-CsTrustedApplication"},"Removes a trusted application from the associated trusted service.","yes","no","no","no","no","no","yes","no","no","no","Get-CsAdminRole | ? {$_.Cmdlets –match \"Remove-CsTrustedApplication\"}"]
["Remove-CsTrustedApplicationComputer","Remove-CsTrustedApplicationComputer",{"$f":"IF(ISTEXT(A498),(HYPERLINK(SUBSTITUTE(HLINK(A498),\".aspx\",\"\")&IF(C$1=2013,\"(v=ocs.15).aspx\",\"(v=ocs.14).aspx\"),A498)),\"\")","v":"Remove-CsTrustedApplicationComputer"},{"$f":"IF(ISTEXT(B498),(HYPERLINK(SUBSTITUTE(HLINK(B498),\".aspx\",\"\")&IF(D$1=2013,\"(v=ocs.15).aspx\",\"(v=ocs.14).aspx\"),B498)),\"\")","v":"Remove-CsTrustedApplicationComputer"},"Removes a trusted application computer.","yes","no","no","no","no","no","yes","no","no","no","Get-CsAdminRole | ? {$_.Cmdlets –match \"Remove-CsTrustedApplicationComputer\"}"]
["Remove-CsTrustedApplicationEndpoint","Remove-CsTrustedApplicationEndpoint",{"$f":"IF(ISTEXT(A499),(HYPERLINK(SUBSTITUTE(HLINK(A499),\".aspx\",\"\")&IF(C$1=2013,\"(v=ocs.15).aspx\",\"(v=ocs.14).aspx\"),A499)),\"\")","v":"Remove-CsTrustedApplicationEndpoint"},{"$f":"IF(ISTEXT(B499),(HYPERLINK(SUBSTITUTE(HLINK(B499),\".aspx\",\"\")&IF(D$1=2013,\"(v=ocs.15).aspx\",\"(v=ocs.14).aspx\"),B499)),\"\")","v":"Remove-CsTrustedApplicationEndpoint"},"Removes a trusted application endpoint.","yes","no","no","no","no","no","yes","no","no","no","Get-CsAdminRole | ? {$_.Cmdlets –match \"Remove-CsTrustedApplicationEndpoint\"}"]
["Remove-CsTrustedApplicationPool","Remove-CsTrustedApplicationPool",{"$f":"IF(ISTEXT(A500),(HYPERLINK(SUBSTITUTE(HLINK(A500),\".aspx\",\"\")&IF(C$1=2013,\"(v=ocs.15).aspx\",\"(v=ocs.14).aspx\"),A500)),\"\")","v":"Remove-CsTrustedApplicationPool"},{"$f":"IF(ISTEXT(B500),(HYPERLINK(SUBSTITUTE(HLINK(B500),\".aspx\",\"\")&IF(D$1=2013,\"(v=ocs.15).aspx\",\"(v=ocs.14).aspx\"),B500)),\"\")","v":"Remove-CsTrustedApplicationPool"},"Removes a pool that contains the computers that host trusted applications.","yes","no","no","no","no","no","yes","no","no","no","Get-CsAdminRole | ? {$_.Cmdlets –match \"Remove-CsTrustedApplicationPool\"}"]
["Remove-CsUCPhoneConfiguration","Remove-CsUCPhoneConfiguration",{"$f":"IF(ISTEXT(A501),(HYPERLINK(SUBSTITUTE(HLINK(A501),\".aspx\",\"\")&IF(C$1=2013,\"(v=ocs.15).aspx\",\"(v=ocs.14).aspx\"),A501)),\"\")","v":"Remove-CsUCPhoneConfiguration"},{"$f":"IF(ISTEXT(B501),(HYPERLINK(SUBSTITUTE(HLINK(B501),\".aspx\",\"\")&IF(D$1=2013,\"(v=ocs.15).aspx\",\"(v=ocs.14).aspx\"),B501)),\"\")","v":"Remove-CsUCPhoneConfiguration"},"Removes the specified collection of Microsoft Lync 2010 Phone Edition configuration settings. These settings include such things as the required security mode as well as whether the phone should automatically be locked after a specified period of inactivity.","yes","no","no","no","no","no","yes","no","no","yes","Get-CsAdminRole | ? {$_.Cmdlets –match \"Remove-CsUCPhoneConfiguration\"}"]
["Remove-CsUnassignedNumber","Remove-CsUnassignedNumber",{"$f":"IF(ISTEXT(A502),(HYPERLINK(SUBSTITUTE(HLINK(A502),\".aspx\",\"\")&IF(C$1=2013,\"(v=ocs.15).aspx\",\"(v=ocs.14).aspx\"),A502)),\"\")","v":"Remove-CsUnassignedNumber"},{"$f":"IF(ISTEXT(B502),(HYPERLINK(SUBSTITUTE(HLINK(B502),\".aspx\",\"\")&IF(D$1=2013,\"(v=ocs.15).aspx\",\"(v=ocs.14).aspx\"),B502)),\"\")","v":"Remove-CsUnassignedNumber"},"Removes an existing range of unassigned numbers and the routing rules that apply to those numbers.","yes","no","no","no","no","no","yes","no","no","yes","Get-CsAdminRole | ? {$_.Cmdlets –match \"Remove-CsUnassignedNumber\"}"]
["Remove-CsUserAcp","Remove-CsUserAcp",{"$f":"IF(ISTEXT(A503),(HYPERLINK(SUBSTITUTE(HLINK(A503),\".aspx\",\"\")&IF(C$1=2013,\"(v=ocs.15).aspx\",\"(v=ocs.14).aspx\"),A503)),\"\")","v":"Remove-CsUserAcp"},{"$f":"IF(ISTEXT(B503),(HYPERLINK(SUBSTITUTE(HLINK(B503),\".aspx\",\"\")&IF(D$1=2013,\"(v=ocs.15).aspx\",\"(v=ocs.14).aspx\"),B503)),\"\")","v":"Remove-CsUserAcp"},"Removes one or more audio conferencing providers assigned to a user or group of users.","yes","no","no","no","no","no","no","yes","no","no","Get-CsAdminRole | ? {$_.Cmdlets –match \"Remove-CsUserAcp\"}"]
["Remove-CsUserReplicatorConfiguration","Remove-CsUserReplicatorConfiguration",{"$f":"IF(ISTEXT(A504),(HYPERLINK(SUBSTITUTE(HLINK(A504),\".aspx\",\"\")&IF(C$1=2013,\"(v=ocs.15).aspx\",\"(v=ocs.14).aspx\"),A504)),\"\")","v":"Remove-CsUserReplicatorConfiguration"},{"$f":"IF(ISTEXT(B504),(HYPERLINK(SUBSTITUTE(HLINK(B504),\".aspx\",\"\")&IF(D$1=2013,\"(v=ocs.15).aspx\",\"(v=ocs.14).aspx\"),B504)),\"\")","v":"Remove-CsUserReplicatorConfiguration"},"Removes the specified collection of User Replicator configuration settings. The User Replicator periodically retrieves up-to-date user account information from Active Directory and then synchronizes the new information with the current user data stored by Microsoft Lync Server 2010.","yes","no","no","no","no","no","yes","no","no","no","Get-CsAdminRole | ? {$_.Cmdlets –match \"Remove-CsUserReplicatorConfiguration\"}"]
["Remove-CsUserServicesConfiguration","Remove-CsUserServicesConfiguration",{"$f":"IF(ISTEXT(A505),(HYPERLINK(SUBSTITUTE(HLINK(A505),\".aspx\",\"\")&IF(C$1=2013,\"(v=ocs.15).aspx\",\"(v=ocs.14).aspx\"),A505)),\"\")","v":"Remove-CsUserServicesConfiguration"},{"$f":"IF(ISTEXT(B505),(HYPERLINK(SUBSTITUTE(HLINK(B505),\".aspx\",\"\")&IF(D$1=2013,\"(v=ocs.15).aspx\",\"(v=ocs.14).aspx\"),B505)),\"\")","v":"Remove-CsUserServicesConfiguration"},"Removes an existing collection of User Services configuration settings. The User Services service is used to help maintain presence information and manage conferencing.","yes","no","no","no","no","no","yes","no","no","no","Get-CsAdminRole | ? {$_.Cmdlets –match \"Remove-CsUserServicesConfiguration\"}"]
[null,"Remove-CsUserServicesPolicy",{"$f":"IF(ISTEXT(A506),(HYPERLINK(SUBSTITUTE(HLINK(A506),\".aspx\",\"\")&IF(C$1=2013,\"(v=ocs.15).aspx\",\"(v=ocs.14).aspx\"),A506)),\"\")","v":""},{"$f":"IF(ISTEXT(B506),(HYPERLINK(SUBSTITUTE(HLINK(B506),\".aspx\",\"\")&IF(D$1=2013,\"(v=ocs.15).aspx\",\"(v=ocs.14).aspx\"),B506)),\"\")","v":"Remove-CsUserServicesPolicy"},"Deletes an existing User Services policy. User Services policies determine whether or not a user's contacts are stored in Lync Server 2013 or in the Unified Contact Store. The Unified Contact Store provides a way for users to maintain a single set of contacts that can be accessed using Lync 2013, Microsoft Outlook, and/or Microsoft Outlook Web Access. This cmdlet was introduced in Lync Server 2013.","yes","no","no","no","no","no","yes","no","no","no","Get-CsAdminRole | ? {$_.Cmdlets –match \"Remove-CsUserServicesPolicy\"}"]
[null,"Remove-CsUserStoreBackupData",{"$f":"IF(ISTEXT(A507),(HYPERLINK(SUBSTITUTE(HLINK(A507),\".aspx\",\"\")&IF(C$1=2013,\"(v=ocs.15).aspx\",\"(v=ocs.14).aspx\"),A507)),\"\")","v":""},{"$f":"IF(ISTEXT(B507),(HYPERLINK(SUBSTITUTE(HLINK(B507),\".aspx\",\"\")&IF(D$1=2013,\"(v=ocs.15).aspx\",\"(v=ocs.14).aspx\"),B507)),\"\")","v":"Remove-CsUserStoreBackupData"},"Removes outdated information from the specified user store. \"Outdated information\" refers user data from a Registrar pool no longer paired with the specified user store. For example, suppose Pools A and B were once paired; now, however, that association has been changed, and Pools A and C are paired. When run against Pool A, the Remove-CsUserStoreBackupData cmdlet will remove information about users from Pool B. This cmdlet was introduced in Lync Server 2013.","yes","no","no","no","no","no","yes","yes","no","no","Get-CsAdminRole | ? {$_.Cmdlets –match \"Remove-CsUserStoreBackupData\"}"]
["Remove-CsVoiceConfiguration","Remove-CsVoiceConfiguration",{"$f":"IF(ISTEXT(A508),(HYPERLINK(SUBSTITUTE(HLINK(A508),\".aspx\",\"\")&IF(C$1=2013,\"(v=ocs.15).aspx\",\"(v=ocs.14).aspx\"),A508)),\"\")","v":"Remove-CsVoiceConfiguration"},{"$f":"IF(ISTEXT(B508),(HYPERLINK(SUBSTITUTE(HLINK(B508),\".aspx\",\"\")&IF(D$1=2013,\"(v=ocs.15).aspx\",\"(v=ocs.14).aspx\"),B508)),\"\")","v":"Remove-CsVoiceConfiguration"},"Resets the voice configuration to its default values.","yes","no","no","no","no","no","yes","no","no","yes","Get-CsAdminRole | ? {$_.Cmdlets –match \"Remove-CsVoiceConfiguration\"}"]
["Remove-CsVoicemailReroutingConfiguration","Remove-CsVoicemailReroutingConfiguration",{"$f":"IF(ISTEXT(A509),(HYPERLINK(SUBSTITUTE(HLINK(A509),\".aspx\",\"\")&IF(C$1=2013,\"(v=ocs.15).aspx\",\"(v=ocs.14).aspx\"),A509)),\"\")","v":"Remove-CsVoicemailReroutingConfiguration"},{"$f":"IF(ISTEXT(B509),(HYPERLINK(SUBSTITUTE(HLINK(B509),\".aspx\",\"\")&IF(D$1=2013,\"(v=ocs.15).aspx\",\"(v=ocs.14).aspx\"),B509)),\"\")","v":"Remove-CsVoicemailReroutingConfiguration"},"Removes settings that provide public switched telephone network (PSTN) phone numbers to access Exchange Unified Messaging (UM) Subscriber Access and Auto Attendant features.","yes","no","no","no","no","no","yes","no","no","yes",{"$f":"\"Get-CsAdminRole | ? {$_.Cmdlets –match \"& CHAR(34) &B509& CHAR(34) &\"}\"","v":"Get-CsAdminRole | ? {$_.Cmdlets –match \"Remove-CsVoicemailReroutingConfiguration\"}"}]
["Remove-CsVoiceNormalizationRule","Remove-CsVoiceNormalizationRule",{"$f":"IF(ISTEXT(A510),(HYPERLINK(SUBSTITUTE(HLINK(A510),\".aspx\",\"\")&IF(C$1=2013,\"(v=ocs.15).aspx\",\"(v=ocs.14).aspx\"),A510)),\"\")","v":"Remove-CsVoiceNormalizationRule"},{"$f":"IF(ISTEXT(B510),(HYPERLINK(SUBSTITUTE(HLINK(B510),\".aspx\",\"\")&IF(D$1=2013,\"(v=ocs.15).aspx\",\"(v=ocs.14).aspx\"),B510)),\"\")","v":"Remove-CsVoiceNormalizationRule"},"Removes a voice normalization rule. Voice normalization rules are used to convert telephone dialing requirements (for example, dialing 9 to access an outside line) to the E.164 phone number format used by Microsoft Lync Server 2010.","yes","no","no","no","no","no","yes","no","no","yes","Get-CsAdminRole | ? {$_.Cmdlets –match \"Remove-CsVoiceNormalizationRule\"}"]
["Remove-CsVoicePolicy","Remove-CsVoicePolicy",{"$f":"IF(ISTEXT(A511),(HYPERLINK(SUBSTITUTE(HLINK(A511),\".aspx\",\"\")&IF(C$1=2013,\"(v=ocs.15).aspx\",\"(v=ocs.14).aspx\"),A511)),\"\")","v":"Remove-CsVoicePolicy"},{"$f":"IF(ISTEXT(B511),(HYPERLINK(SUBSTITUTE(HLINK(B511),\".aspx\",\"\")&IF(D$1=2013,\"(v=ocs.15).aspx\",\"(v=ocs.14).aspx\"),B511)),\"\")","v":"Remove-CsVoicePolicy"},"Removes the specified voice policy.","yes","no","no","no","no","no","yes","no","no","yes","Get-CsAdminRole | ? {$_.Cmdlets –match \"Remove-CsVoicePolicy\"}"]
["Remove-CsVoiceRoute","Remove-CsVoiceRoute",{"$f":"IF(ISTEXT(A512),(HYPERLINK(SUBSTITUTE(HLINK(A512),\".aspx\",\"\")&IF(C$1=2013,\"(v=ocs.15).aspx\",\"(v=ocs.14).aspx\"),A512)),\"\")","v":"Remove-CsVoiceRoute"},{"$f":"IF(ISTEXT(B512),(HYPERLINK(SUBSTITUTE(HLINK(B512),\".aspx\",\"\")&IF(D$1=2013,\"(v=ocs.15).aspx\",\"(v=ocs.14).aspx\"),B512)),\"\")","v":"Remove-CsVoiceRoute"},"Removes a voice route. Voice routes contain instructions that tell Microsoft Lync Server 2010 how to route calls from Enterprise Voice users to phone numbers on the public switched telephone network (PSTN) or a private branch exchange (PBX).","yes","no","no","no","no","no","yes","no","no","yes","Get-CsAdminRole | ? {$_.Cmdlets –match \"Remove-CsVoiceRoute\"}"]
[null,"Remove-CsVoiceRoutingPolicy",{"$f":"IF(ISTEXT(A513),(HYPERLINK(SUBSTITUTE(HLINK(A513),\".aspx\",\"\")&IF(C$1=2013,\"(v=ocs.15).aspx\",\"(v=ocs.14).aspx\"),A513)),\"\")","v":""},{"$f":"IF(ISTEXT(B513),(HYPERLINK(SUBSTITUTE(HLINK(B513),\".aspx\",\"\")&IF(D$1=2013,\"(v=ocs.15).aspx\",\"(v=ocs.14).aspx\"),B513)),\"\")","v":"Remove-CsVoiceRoutingPolicy"},"Deletes an existing voice routing policy. Voice routing policies manage PSTN usages for users of hybrid voice. Hybrid voice enables users homed on Lync Online to take advantage of the Enterprise Voice capabilities available in an on-premises installation of Lync Server 2013. This cmdlet was introduced in Lync Server 2013.","yes","no","no","no","no","no","yes","no","no","yes","Get-CsAdminRole | ? {$_.Cmdlets –match \"Remove-CsVoiceRoutingPolicy\"}"]
["Remove-CsVoiceTestConfiguration","Remove-CsVoiceTestConfiguration",{"$f":"IF(ISTEXT(A514),(HYPERLINK(SUBSTITUTE(HLINK(A514),\".aspx\",\"\")&IF(C$1=2013,\"(v=ocs.15).aspx\",\"(v=ocs.14).aspx\"),A514)),\"\")","v":"Remove-CsVoiceTestConfiguration"},{"$f":"IF(ISTEXT(B514),(HYPERLINK(SUBSTITUTE(HLINK(B514),\".aspx\",\"\")&IF(D$1=2013,\"(v=ocs.15).aspx\",\"(v=ocs.14).aspx\"),B514)),\"\")","v":"Remove-CsVoiceTestConfiguration"},"Removes a voice test configuration that was used to test phone numbers against specified routes and rules.","yes","no","no","no","no","no","yes","no","no","yes","Get-CsAdminRole | ? {$_.Cmdlets –match \"Remove-CsVoiceTestConfiguration\"}"]
[null,"Remove-CsWatcherNodeConfiguration",{"$f":"IF(ISTEXT(A515),(HYPERLINK(SUBSTITUTE(HLINK(A515),\".aspx\",\"\")&IF(C$1=2013,\"(v=ocs.15).aspx\",\"(v=ocs.14).aspx\"),A515)),\"\")","v":""},{"$f":"IF(ISTEXT(B515),(HYPERLINK(SUBSTITUTE(HLINK(B515),\".aspx\",\"\")&IF(D$1=2013,\"(v=ocs.15).aspx\",\"(v=ocs.14).aspx\"),B515)),\"\")","v":"Remove-CsWatcherNodeConfiguration"},"Removes an existing collection of watcher node configuration settings. Watcher nodes are computers that periodically use System Center Operations Manager and Lync Server 2013 synthetic transactions to verify that Lync Server components are working as expected.","yes","no","no","no","no","no","yes","no","no","no","Get-CsAdminRole | ? {$_.Cmdlets –match \"Remove-CsWatcherNodeConfiguration\"}"]
["Remove-CsWebServiceConfiguration","Remove-CsWebServiceConfiguration",{"$f":"IF(ISTEXT(A516),(HYPERLINK(SUBSTITUTE(HLINK(A516),\".aspx\",\"\")&IF(C$1=2013,\"(v=ocs.15).aspx\",\"(v=ocs.14).aspx\"),A516)),\"\")","v":"Remove-CsWebServiceConfiguration"},{"$f":"IF(ISTEXT(B516),(HYPERLINK(SUBSTITUTE(HLINK(B516),\".aspx\",\"\")&IF(D$1=2013,\"(v=ocs.15).aspx\",\"(v=ocs.14).aspx\"),B516)),\"\")","v":"Remove-CsWebServiceConfiguration"},"Removes one or more collections of Web Services configuration settings.","yes","no","no","no","no","no","yes","no","no","no","Get-CsAdminRole | ? {$_.Cmdlets –match \"Remove-CsWebServiceConfiguration\"}"]
[null,"Remove-CsXmppAllowedPartner",{"$f":"IF(ISTEXT(A517),(HYPERLINK(SUBSTITUTE(HLINK(A517),\".aspx\",\"\")&IF(C$1=2013,\"(v=ocs.15).aspx\",\"(v=ocs.14).aspx\"),A517)),\"\")","v":""},{"$f":"IF(ISTEXT(B517),(HYPERLINK(SUBSTITUTE(HLINK(B517),\".aspx\",\"\")&IF(D$1=2013,\"(v=ocs.15).aspx\",\"(v=ocs.14).aspx\"),B517)),\"\")","v":"Remove-CsXmppAllowedPartner"},"Removes an existing XMPP allowed partner. The extensible Messaging and Presence Protocol (XMPP) is an open-standard communications protocol for exchanging messages using XML. An allowed partner is an IM and presence provider whose users are allowed to exchange instant messages and presence information with your Lync Server 2013 users. This cmdlet was introduced in Lync Server 2013.","yes","no","no","no","no","no","yes","no","no","no","Get-CsAdminRole | ? {$_.Cmdlets –match \"Remove-CsXmppAllowedPartner\"}"]
["Request-CsCertificate","Request-CsCertificate",{"$f":"IF(ISTEXT(A518),(HYPERLINK(SUBSTITUTE(HLINK(A518),\".aspx\",\"\")&IF(C$1=2013,\"(v=ocs.15).aspx\",\"(v=ocs.14).aspx\"),A518)),\"\")","v":"Request-CsCertificate"},{"$f":"IF(ISTEXT(B518),(HYPERLINK(SUBSTITUTE(HLINK(B518),\".aspx\",\"\")&IF(D$1=2013,\"(v=ocs.15).aspx\",\"(v=ocs.14).aspx\"),B518)),\"\")","v":"Request-CsCertificate"},"Provides a way to request certificates for use with Microsoft Lync Server 2010 servers and server roles. Also provides a way to check the status of existing certificate requests and, if needed, to cancel any (or all) of those requests.","no","no","no","no","no","no","no","no","no","no","Get-CsAdminRole | ? {$_.Cmdlets –match \"Request-CsCertificate\"}"]
["Reset-CsDeviceUpdateRule","Reset-CsDeviceUpdateRule",{"$f":"IF(ISTEXT(A519),(HYPERLINK(SUBSTITUTE(HLINK(A519),\".aspx\",\"\")&IF(C$1=2013,\"(v=ocs.15).aspx\",\"(v=ocs.14).aspx\"),A519)),\"\")","v":"Reset-CsDeviceUpdateRule"},{"$f":"IF(ISTEXT(B519),(HYPERLINK(SUBSTITUTE(HLINK(B519),\".aspx\",\"\")&IF(D$1=2013,\"(v=ocs.15).aspx\",\"(v=ocs.14).aspx\"),B519)),\"\")","v":"Reset-CsDeviceUpdateRule"},"Rejects a device update rule that has been imported to the system.","yes","no","no","no","no","no","yes","no","no","yes","Get-CsAdminRole | ? {$_.Cmdlets –match \"Reset-CsDeviceUpdateRule\"}"]
[null,"Reset-CsPoolRegistrarState",{"$f":"IF(ISTEXT(A520),(HYPERLINK(SUBSTITUTE(HLINK(A520),\".aspx\",\"\")&IF(C$1=2013,\"(v=ocs.15).aspx\",\"(v=ocs.14).aspx\"),A520)),\"\")","v":""},{"$f":"IF(ISTEXT(B520),(HYPERLINK(SUBSTITUTE(HLINK(B520),\".aspx\",\"\")&IF(D$1=2013,\"(v=ocs.15).aspx\",\"(v=ocs.14).aspx\"),B520)),\"\")","v":"Reset-CsPoolRegistrarState"},"Resets the Registrar and Windows fabric services for the specified Registrar pool. This cmdlet was introduced in Lync Server 2013.","no","no","no","no","no","no","no","no","no","no","Get-CsAdminRole | ? {$_.Cmdlets –match \"Reset-CsPoolRegistrarState\"}"]
["Restore-CsDeviceUpdateRule","Restore-CsDeviceUpdateRule",{"$f":"IF(ISTEXT(A521),(HYPERLINK(SUBSTITUTE(HLINK(A521),\".aspx\",\"\")&IF(C$1=2013,\"(v=ocs.15).aspx\",\"(v=ocs.14).aspx\"),A521)),\"\")","v":"Restore-CsDeviceUpdateRule"},{"$f":"IF(ISTEXT(B521),(HYPERLINK(SUBSTITUTE(HLINK(B521),\".aspx\",\"\")&IF(D$1=2013,\"(v=ocs.15).aspx\",\"(v=ocs.14).aspx\"),B521)),\"\")","v":"Restore-CsDeviceUpdateRule"},"Enables you to \"roll back\" a device update rule that has been approved for use in the organization. When you restore a device update rule, the approved version of that rule is reset to reflect the update that was in use before the rule was approved. In turn, client devices that log on to the system will automatically uninstall the most recent update, and then download and reinstall the previous version of that update.","yes","no","no","no","no","no","yes","no","no","yes","Get-CsAdminRole | ? {$_.Cmdlets –match \"Restore-CsDeviceUpdateRule\"}"]
["Revoke-CsClientCertificate","Revoke-CsClientCertificate",{"$f":"IF(ISTEXT(A522),(HYPERLINK(SUBSTITUTE(HLINK(A522),\".aspx\",\"\")&IF(C$1=2013,\"(v=ocs.15).aspx\",\"(v=ocs.14).aspx\"),A522)),\"\")","v":"Revoke-CsClientCertificate"},{"$f":"IF(ISTEXT(B522),(HYPERLINK(SUBSTITUTE(HLINK(B522),\".aspx\",\"\")&IF(D$1=2013,\"(v=ocs.15).aspx\",\"(v=ocs.14).aspx\"),B522)),\"\")","v":"Revoke-CsClientCertificate"},"Client certificates provide a way for users to be authenticated when logging on to Microsoft Lync Server 2010. Certificates are particularly useful for telephones and other devices running Microsoft Lync 2010 Phone Edition where it is difficult to enter a user name and/or password. The Revoke-CsClientCertificate provides a way for administrators to revoke client certificates that have been issued to a user.","yes","no","no","no","no","no","no","yes","no","no","Get-CsAdminRole | ? {$_.Cmdlets –match \"Revoke-CsClientCertificate\"}"]
["Revoke-CsOUPermission","Revoke-CsOUPermission",{"$f":"IF(ISTEXT(A523),(HYPERLINK(SUBSTITUTE(HLINK(A523),\".aspx\",\"\")&IF(C$1=2013,\"(v=ocs.15).aspx\",\"(v=ocs.14).aspx\"),A523)),\"\")","v":"Revoke-CsOUPermission"},{"$f":"IF(ISTEXT(B523),(HYPERLINK(SUBSTITUTE(HLINK(B523),\".aspx\",\"\")&IF(D$1=2013,\"(v=ocs.15).aspx\",\"(v=ocs.14).aspx\"),B523)),\"\")","v":"Revoke-CsOUPermission"},"Revokes the Microsoft Lync Server 2010 management permissions that have been granted on an Active Directory organizational unit (OU).","no","no","no","no","no","no","no","no","no","no","Get-CsAdminRole | ? {$_.Cmdlets –match \"Revoke-CsOUPermission\"}"]
["Revoke-CsSetupPermission","Revoke-CsSetupPermission",{"$f":"IF(ISTEXT(A524),(HYPERLINK(SUBSTITUTE(HLINK(A524),\".aspx\",\"\")&IF(C$1=2013,\"(v=ocs.15).aspx\",\"(v=ocs.14).aspx\"),A524)),\"\")","v":"Revoke-CsSetupPermission"},{"$f":"IF(ISTEXT(B524),(HYPERLINK(SUBSTITUTE(HLINK(B524),\".aspx\",\"\")&IF(D$1=2013,\"(v=ocs.15).aspx\",\"(v=ocs.14).aspx\"),B524)),\"\")","v":"Revoke-CsSetupPermission"},"Revokes the Microsoft Lync Server 2010 setup permissions that have been granted on an Active Directory organizational unit (OU).","no","no","no","no","no","no","no","no","no","no","Get-CsAdminRole | ? {$_.Cmdlets –match \"Revoke-CsSetupPermission\"}"]
[null,"Search-CsClsLogging",{"$f":"IF(ISTEXT(A525),(HYPERLINK(SUBSTITUTE(HLINK(A525),\".aspx\",\"\")&IF(C$1=2013,\"(v=ocs.15).aspx\",\"(v=ocs.14).aspx\"),A525)),\"\")","v":""},{"$f":"IF(ISTEXT(B525),(HYPERLINK(SUBSTITUTE(HLINK(B525),\".aspx\",\"\")&IF(D$1=2013,\"(v=ocs.15).aspx\",\"(v=ocs.14).aspx\"),B525)),\"\")","v":"Search-CsClsLogging"},"Provides a command-line option for searching the centralized logging service log files. This cmdlet was introduced in Lync Server 2013.","yes","no","no","no","no","no","yes","no","no","no","Get-CsAdminRole | ? {$_.Cmdlets –match \"Search-CsClsLogging\"}"]
["Set-CsAccessEdgeConfiguration","Set-CsAccessEdgeConfiguration",{"$f":"IF(ISTEXT(A526),(HYPERLINK(SUBSTITUTE(HLINK(A526),\".aspx\",\"\")&IF(C$1=2013,\"(v=ocs.15).aspx\",\"(v=ocs.14).aspx\"),A526)),\"\")","v":"Set-CsAccessEdgeConfiguration"},{"$f":"IF(ISTEXT(B526),(HYPERLINK(SUBSTITUTE(HLINK(B526),\".aspx\",\"\")&IF(D$1=2013,\"(v=ocs.15).aspx\",\"(v=ocs.14).aspx\"),B526)),\"\")","v":"Set-CsAccessEdgeConfiguration"},"Modifies the property values of an existing collection of Access Edge configuration settings for computers running the Access Edge service. The Access Edge service running on these computers (also known as Edge servers) provides a way for users outside your internal network to communicate with users inside that internal network.","yes","no","no","no","no","no","yes","no","no","no","Get-CsAdminRole | ? {$_.Cmdlets –match \"Set-CsAccessEdgeConfiguration\"}"]
["Set-CsAddressBookConfiguration","Set-CsAddressBookConfiguration",{"$f":"IF(ISTEXT(A527),(HYPERLINK(SUBSTITUTE(HLINK(A527),\".aspx\",\"\")&IF(C$1=2013,\"(v=ocs.15).aspx\",\"(v=ocs.14).aspx\"),A527)),\"\")","v":"Set-CsAddressBookConfiguration"},{"$f":"IF(ISTEXT(B527),(HYPERLINK(SUBSTITUTE(HLINK(B527),\".aspx\",\"\")&IF(D$1=2013,\"(v=ocs.15).aspx\",\"(v=ocs.14).aspx\"),B527)),\"\")","v":"Set-CsAddressBookConfiguration"},"Modifies an existing collection of Address Book configuration settings.","yes","no","no","no","no","no","yes","no","no","no",{"$f":"\"Get-CsAdminRole | ? {$_.Cmdlets –match \"& CHAR(34) &B527& CHAR(34) &\"}\"","v":"Get-CsAdminRole | ? {$_.Cmdlets –match \"Set-CsAddressBookConfiguration\"}"}]
["Set-CsAdminRole","Set-CsAdminRole",{"$f":"IF(ISTEXT(A528),(HYPERLINK(SUBSTITUTE(HLINK(A528),\".aspx\",\"\")&IF(C$1=2013,\"(v=ocs.15).aspx\",\"(v=ocs.14).aspx\"),A528)),\"\")","v":"Set-CsAdminRole"},{"$f":"IF(ISTEXT(B528),(HYPERLINK(SUBSTITUTE(HLINK(B528),\".aspx\",\"\")&IF(D$1=2013,\"(v=ocs.15).aspx\",\"(v=ocs.14).aspx\"),B528)),\"\")","v":"Set-CsAdminRole"},"Modifies an existing role-based access control (RBAC) role. RBAC roles are used to specify the management tasks that users are allowed to carry out, and to determine the scope in which users will be allowed to perform these tasks.","yes","no","no","no","no","no","no","no","no","no","Get-CsAdminRole | ? {$_.Cmdlets –match \"Set-CsAdminRole\"}"]
["Set-CsAllowedDomain","Set-CsAllowedDomain",{"$f":"IF(ISTEXT(A529),(HYPERLINK(SUBSTITUTE(HLINK(A529),\".aspx\",\"\")&IF(C$1=2013,\"(v=ocs.15).aspx\",\"(v=ocs.14).aspx\"),A529)),\"\")","v":"Set-CsAllowedDomain"},{"$f":"IF(ISTEXT(B529),(HYPERLINK(SUBSTITUTE(HLINK(B529),\".aspx\",\"\")&IF(D$1=2013,\"(v=ocs.15).aspx\",\"(v=ocs.14).aspx\"),B529)),\"\")","v":"Set-CsAllowedDomain"},"Modifies property values for a domain (or domains) included on the list of domains approved for federation. After a domain has been approved for federation (by being added to the allowed list), your users can exchange instant messages and presence information with people who have accounts in the federated domain.","yes","no","no","no","no","no","yes","no","no","no","Get-CsAdminRole | ? {$_.Cmdlets –match \"Set-CsAllowedDomain\"}"]
["Set-CsAnalogDevice","Set-CsAnalogDevice",{"$f":"IF(ISTEXT(A530),(HYPERLINK(SUBSTITUTE(HLINK(A530),\".aspx\",\"\")&IF(C$1=2013,\"(v=ocs.15).aspx\",\"(v=ocs.14).aspx\"),A530)),\"\")","v":"Set-CsAnalogDevice"},{"$f":"IF(ISTEXT(B530),(HYPERLINK(SUBSTITUTE(HLINK(B530),\".aspx\",\"\")&IF(D$1=2013,\"(v=ocs.15).aspx\",\"(v=ocs.14).aspx\"),B530)),\"\")","v":"Set-CsAnalogDevice"},"Modifies an existing device in the collection of analog devices that can be managed by using Microsoft Lync Server 2010. An analog device is a telephone or other device that is connected to the public switched telephone network (PSTN).","yes","no","no","no","no","no","yes","yes","no","yes","Get-CsAdminRole | ? {$_.Cmdlets –match \"Set-CsAnalogDevice\"}"]
["Set-CsAnnouncement","Set-CsAnnouncement",{"$f":"IF(ISTEXT(A531),(HYPERLINK(SUBSTITUTE(HLINK(A531),\".aspx\",\"\")&IF(C$1=2013,\"(v=ocs.15).aspx\",\"(v=ocs.14).aspx\"),A531)),\"\")","v":"Set-CsAnnouncement"},{"$f":"IF(ISTEXT(B531),(HYPERLINK(SUBSTITUTE(HLINK(B531),\".aspx\",\"\")&IF(D$1=2013,\"(v=ocs.15).aspx\",\"(v=ocs.14).aspx\"),B531)),\"\")","v":"Set-CsAnnouncement"},"Modifies the property values of an existing Microsoft Lync Server 2010 announcement. Announcements are played when users dial a valid but unassigned phone number. An announcement can be a message (such as \"This number is temporarily out of service\") or a busy signal.","yes","no","no","no","no","no","yes","no","no","yes","Get-CsAdminRole | ? {$_.Cmdlets –match \"Set-CsAnnouncement\"}"]
["Set-CsApplicationServer","Set-CsApplicationServer",{"$f":"IF(ISTEXT(A532),(HYPERLINK(SUBSTITUTE(HLINK(A532),\".aspx\",\"\")&IF(C$1=2013,\"(v=ocs.15).aspx\",\"(v=ocs.14).aspx\"),A532)),\"\")","v":"Set-CsApplicationServer"},{"$f":"IF(ISTEXT(B532),(HYPERLINK(SUBSTITUTE(HLINK(B532),\".aspx\",\"\")&IF(D$1=2013,\"(v=ocs.15).aspx\",\"(v=ocs.14).aspx\"),B532)),\"\")","v":"Set-CsApplicationServer"},"Enables you to modify configuration properties of one or more servers running the Application service. These servers (also known as Application Servers) host software programs, such as the Call Park application, that were developed using the Microsoft Unified Communications Managed API (UCMA) set.","yes","no","no","no","no","no","yes","no","no","no","Get-CsAdminRole | ? {$_.Cmdlets –match \"Set-CsApplicationServer\"}"]
["Set-CsArchivingConfiguration","Set-CsArchivingConfiguration",{"$f":"IF(ISTEXT(A533),(HYPERLINK(SUBSTITUTE(HLINK(A533),\".aspx\",\"\")&IF(C$1=2013,\"(v=ocs.15).aspx\",\"(v=ocs.14).aspx\"),A533)),\"\")","v":"Set-CsArchivingConfiguration"},{"$f":"IF(ISTEXT(B533),(HYPERLINK(SUBSTITUTE(HLINK(B533),\".aspx\",\"\")&IF(D$1=2013,\"(v=ocs.15).aspx\",\"(v=ocs.14).aspx\"),B533)),\"\")","v":"Set-CsArchivingConfiguration"},"Modifies an existing collection of instant messaging (IM) archiving settings.","yes","yes","no","no","no","no","no","no","no","no","Get-CsAdminRole | ? {$_.Cmdlets –match \"Set-CsArchivingConfiguration\"}"]
["Set-CsArchivingPolicy","Set-CsArchivingPolicy",{"$f":"IF(ISTEXT(A534),(HYPERLINK(SUBSTITUTE(HLINK(A534),\".aspx\",\"\")&IF(C$1=2013,\"(v=ocs.15).aspx\",\"(v=ocs.14).aspx\"),A534)),\"\")","v":"Set-CsArchivingPolicy"},{"$f":"IF(ISTEXT(B534),(HYPERLINK(SUBSTITUTE(HLINK(B534),\".aspx\",\"\")&IF(D$1=2013,\"(v=ocs.15).aspx\",\"(v=ocs.14).aspx\"),B534)),\"\")","v":"Set-CsArchivingPolicy"},"Modifies an existing instant messaging (IM) archiving policy. An archiving policy gives you the ability to archive all IM sessions and conferences that take place between internal users; you can also archive sessions that take place between internal users and federated partners.","yes","yes","no","no","no","no","no","no","no","no","Get-CsAdminRole | ? {$_.Cmdlets –match \"Set-CsArchivingPolicy\"}"]
["Set-CsArchivingServer","Set-CsArchivingServer",{"$f":"IF(ISTEXT(A535),(HYPERLINK(SUBSTITUTE(HLINK(A535),\".aspx\",\"\")&IF(C$1=2013,\"(v=ocs.15).aspx\",\"(v=ocs.14).aspx\"),A535)),\"\")","v":"Set-CsArchivingServer"},{"$f":"IF(ISTEXT(B535),(HYPERLINK(SUBSTITUTE(HLINK(B535),\".aspx\",\"\")&IF(D$1=2013,\"(v=ocs.15).aspx\",\"(v=ocs.14).aspx\"),B535)),\"\")","v":"Set-CsArchivingServer"},"Enables you to specify a new database location for one or more Archiving Servers.","yes","yes","no","no","no","no","no","no","no","no","Get-CsAdminRole | ? {$_.Cmdlets –match \"Set-CsArchivingServer\"}"]
["Set-CsAudioTestServiceApplication","Set-CsAudioTestServiceApplication",{"$f":"IF(ISTEXT(A536),(HYPERLINK(SUBSTITUTE(HLINK(A536),\".aspx\",\"\")&IF(C$1=2013,\"(v=ocs.15).aspx\",\"(v=ocs.14).aspx\"),A536)),\"\")","v":"Set-CsAudioTestServiceApplication"},{"$f":"IF(ISTEXT(B536),(HYPERLINK(SUBSTITUTE(HLINK(B536),\".aspx\",\"\")&IF(D$1=2013,\"(v=ocs.15).aspx\",\"(v=ocs.14).aspx\"),B536)),\"\")","v":"Set-CsAudioTestServiceApplication"},"Enables you to modify the property values for any of the Audio Test service application contacts currently in use in your organization.","yes","no","no","no","no","no","yes","no","no","yes","Get-CsAdminRole | ? {$_.Cmdlets –match \"Set-CsAudioTestServiceApplication\"}"]
["Set-CsAutoDiscoverConfiguration","Set-CsAutodiscoverConfiguration",{"$f":"IF(ISTEXT(A537),(HYPERLINK(SUBSTITUTE(HLINK(A537),\".aspx\",\"\")&IF(C$1=2013,\"(v=ocs.15).aspx\",\"(v=ocs.14).aspx\"),A537)),\"\")","v":"Set-CsAutoDiscoverConfiguration"},{"$f":"IF(ISTEXT(B537),(HYPERLINK(SUBSTITUTE(HLINK(B537),\".aspx\",\"\")&IF(D$1=2013,\"(v=ocs.15).aspx\",\"(v=ocs.14).aspx\"),B537)),\"\")","v":"Set-CsAutodiscoverConfiguration"},"Modifies an existing collection of Autodiscover Service configuration settings. The Autodiscover Service provides a way for client applications such as Lync Web App or Lync Mobile to locate key resources such as a user's home pool or the URL for joining a dial-in conference. This cmdlet was introduced in the cumulative update for Lync Server 2010: November 2011.","yes","no","no","no","no","no","yes","no","no","no","Get-CsAdminRole | ? {$_.Cmdlets –match \"Set-CsAutodiscoverConfiguration\"}"]
["Set-CsAVEdgeConfiguration","Set-CsAVEdgeConfiguration",{"$f":"IF(ISTEXT(A538),(HYPERLINK(SUBSTITUTE(HLINK(A538),\".aspx\",\"\")&IF(C$1=2013,\"(v=ocs.15).aspx\",\"(v=ocs.14).aspx\"),A538)),\"\")","v":"Set-CsAVEdgeConfiguration"},{"$f":"IF(ISTEXT(B538),(HYPERLINK(SUBSTITUTE(HLINK(B538),\".aspx\",\"\")&IF(D$1=2013,\"(v=ocs.15).aspx\",\"(v=ocs.14).aspx\"),B538)),\"\")","v":"Set-CsAVEdgeConfiguration"},"Enables you to modify configuration settings for computers running the A/V Edge service (these computers are also known as A/V Edge servers). An A/V Edge server enables internal users to share audio and video data with external users (that is, users who are not logged on to your internal network), as well as exchange files and participate in desktop sharing sessions.","yes","no","no","no","no","no","yes","no","no","no","Get-CsAdminRole | ? {$_.Cmdlets –match \"Set-CsAVEdgeConfiguration\"}"]
[null,"Set-CsBackupServiceConfiguration",{"$f":"IF(ISTEXT(A539),(HYPERLINK(SUBSTITUTE(HLINK(A539),\".aspx\",\"\")&IF(C$1=2013,\"(v=ocs.15).aspx\",\"(v=ocs.14).aspx\"),A539)),\"\")","v":""},{"$f":"IF(ISTEXT(B539),(HYPERLINK(SUBSTITUTE(HLINK(B539),\".aspx\",\"\")&IF(D$1=2013,\"(v=ocs.15).aspx\",\"(v=ocs.14).aspx\"),B539)),\"\")","v":"Set-CsBackupServiceConfiguration"},"Retrieves the backup service configuration settings for Lync Server 2013. These settings include information about the maximum number of simultaneous Windows Communication Framework calls that can be made to the backup service as well as the backup service synchronization interval. This cmdlet was introduced in Lync Server 2013.","yes","no","no","no","no","no","yes","no","no","no","Get-CsAdminRole | ? {$_.Cmdlets –match \"Set-CsBackupServiceConfiguration\"}"]
["Set-CsBandwidthPolicyServiceConfiguration","Set-CsBandwidthPolicyServiceConfiguration",{"$f":"IF(ISTEXT(A540),(HYPERLINK(SUBSTITUTE(HLINK(A540),\".aspx\",\"\")&IF(C$1=2013,\"(v=ocs.15).aspx\",\"(v=ocs.14).aspx\"),A540)),\"\")","v":"Set-CsBandwidthPolicyServiceConfiguration"},{"$f":"IF(ISTEXT(B540),(HYPERLINK(SUBSTITUTE(HLINK(B540),\".aspx\",\"\")&IF(D$1=2013,\"(v=ocs.15).aspx\",\"(v=ocs.14).aspx\"),B540)),\"\")","v":"Set-CsBandwidthPolicyServiceConfiguration"},"Modifies an existing bandwidth policy service configuration.","yes","no","no","no","no","no","yes","no","no","yes","Get-CsAdminRole | ? {$_.Cmdlets –match \"Set-CsBandwidthPolicyServiceConfiguration\"}"]
["Set-CsBlockedDomain","Set-CsBlockedDomain",{"$f":"IF(ISTEXT(A541),(HYPERLINK(SUBSTITUTE(HLINK(A541),\".aspx\",\"\")&IF(C$1=2013,\"(v=ocs.15).aspx\",\"(v=ocs.14).aspx\"),A541)),\"\")","v":"Set-CsBlockedDomain"},{"$f":"IF(ISTEXT(B541),(HYPERLINK(SUBSTITUTE(HLINK(B541),\".aspx\",\"\")&IF(D$1=2013,\"(v=ocs.15).aspx\",\"(v=ocs.14).aspx\"),B541)),\"\")","v":"Set-CsBlockedDomain"},"Modifies the Comment property for one or more of the domains included on the list of domains that are blocked for federation. By definition, your users are not allowed to use Microsoft Lync Server 2010 applications to communicate with people from the blocked domain; for example, users cannot employ Microsoft Lync 2010 to exchange instant messages with anyone with a SIP account in a domain that appears on the blocked list.","yes","no","no","no","no","no","yes","no","no","no","Get-CsAdminRole | ? {$_.Cmdlets –match \"Set-CsBlockedDomain\"}"]
["Set-CsCallParkOrbit","Set-CsCallParkOrbit",{"$f":"IF(ISTEXT(A542),(HYPERLINK(SUBSTITUTE(HLINK(A542),\".aspx\",\"\")&IF(C$1=2013,\"(v=ocs.15).aspx\",\"(v=ocs.14).aspx\"),A542)),\"\")","v":"Set-CsCallParkOrbit"},{"$f":"IF(ISTEXT(B542),(HYPERLINK(SUBSTITUTE(HLINK(B542),\".aspx\",\"\")&IF(D$1=2013,\"(v=ocs.15).aspx\",\"(v=ocs.14).aspx\"),B542)),\"\")","v":"Set-CsCallParkOrbit"},"Sets the properties for an existing call park orbit range within an organization.","yes","no","no","no","no","no","yes","no","no","yes","Get-CsAdminRole | ? {$_.Cmdlets –match \"Set-CsCallParkOrbit\"}"]
["Set-CsCallParkServiceMusicOnHoldFile","Set-CsCallParkServiceMusicOnHoldFile",{"$f":"IF(ISTEXT(A543),(HYPERLINK(SUBSTITUTE(HLINK(A543),\".aspx\",\"\")&IF(C$1=2013,\"(v=ocs.15).aspx\",\"(v=ocs.14).aspx\"),A543)),\"\")","v":"Set-CsCallParkServiceMusicOnHoldFile"},{"$f":"IF(ISTEXT(B543),(HYPERLINK(SUBSTITUTE(HLINK(B543),\".aspx\",\"\")&IF(D$1=2013,\"(v=ocs.15).aspx\",\"(v=ocs.14).aspx\"),B543)),\"\")","v":"Set-CsCallParkServiceMusicOnHoldFile"},"Changes the audio file that will be played to callers who are on hold in a parked call.","yes","no","no","no","no","no","yes","no","no","yes","Get-CsAdminRole | ? {$_.Cmdlets –match \"Set-CsCallParkServiceMusicOnHoldFile\"}"]
["Set-CsCdrConfiguration","Set-CsCdrConfiguration",{"$f":"IF(ISTEXT(A544),(HYPERLINK(SUBSTITUTE(HLINK(A544),\".aspx\",\"\")&IF(C$1=2013,\"(v=ocs.15).aspx\",\"(v=ocs.14).aspx\"),A544)),\"\")","v":"Set-CsCdrConfiguration"},{"$f":"IF(ISTEXT(B544),(HYPERLINK(SUBSTITUTE(HLINK(B544),\".aspx\",\"\")&IF(D$1=2013,\"(v=ocs.15).aspx\",\"(v=ocs.14).aspx\"),B544)),\"\")","v":"Set-CsCdrConfiguration"},"Modifies an existing collection of call detail recording (CDR) settings. CDR enables you to track usage of such things as peer-to-peer instant messaging sessions, Voice over Internet Protocol (VoIP) phone calls, and conferencing calls. This usage data includes information about who called whom, when they called, and how long they talked.","yes","no","no","no","no","no","yes","no","no","no","Get-CsAdminRole | ? {$_.Cmdlets –match \"Set-CsCdrConfiguration\"}"]
["Set-CsCertificate","Set-CsCertificate",{"$f":"IF(ISTEXT(A545),(HYPERLINK(SUBSTITUTE(HLINK(A545),\".aspx\",\"\")&IF(C$1=2013,\"(v=ocs.15).aspx\",\"(v=ocs.14).aspx\"),A545)),\"\")","v":"Set-CsCertificate"},{"$f":"IF(ISTEXT(B545),(HYPERLINK(SUBSTITUTE(HLINK(B545),\".aspx\",\"\")&IF(D$1=2013,\"(v=ocs.15).aspx\",\"(v=ocs.14).aspx\"),B545)),\"\")","v":"Set-CsCertificate"},"Enables you to assign a certificate to a Microsoft Lync Server 2010 server or server role.","no","no","no","no","no","no","no","no","no","no","Get-CsAdminRole | ? {$_.Cmdlets –match \"Set-CsCertificate\"}"]
["Set-CsClientPin","Set-CsClientPin",{"$f":"IF(ISTEXT(A546),(HYPERLINK(SUBSTITUTE(HLINK(A546),\".aspx\",\"\")&IF(C$1=2013,\"(v=ocs.15).aspx\",\"(v=ocs.14).aspx\"),A546)),\"\")","v":"Set-CsClientPin"},{"$f":"IF(ISTEXT(B546),(HYPERLINK(SUBSTITUTE(HLINK(B546),\".aspx\",\"\")&IF(D$1=2013,\"(v=ocs.15).aspx\",\"(v=ocs.14).aspx\"),B546)),\"\")","v":"Set-CsClientPin"},"Assigns a new personal identification number (PIN) to the specified user.","yes","no","yes","no","no","no","no","yes","no","yes","Get-CsAdminRole | ? {$_.Cmdlets –match \"Set-CsClientPin\"}"]
["Set-CsClientPolicy","Set-CsClientPolicy",{"$f":"IF(ISTEXT(A547),(HYPERLINK(SUBSTITUTE(HLINK(A547),\".aspx\",\"\")&IF(C$1=2013,\"(v=ocs.15).aspx\",\"(v=ocs.14).aspx\"),A547)),\"\")","v":"Set-CsClientPolicy"},{"$f":"IF(ISTEXT(B547),(HYPERLINK(SUBSTITUTE(HLINK(B547),\".aspx\",\"\")&IF(D$1=2013,\"(v=ocs.15).aspx\",\"(v=ocs.14).aspx\"),B547)),\"\")","v":"Set-CsClientPolicy"},"Modifies the property values of an existing client policy. Among other things, client policies help determine the features of Microsoft Lync 2010 that are available to users; for example, you might give some users the right to transfer files while denying this right to other users.","yes","no","no","no","no","no","yes","no","no","no","Get-CsAdminRole | ? {$_.Cmdlets –match \"Set-CsClientPolicy\"}"]
["Set-CsClientVersionConfiguration","Set-CsClientVersionConfiguration",{"$f":"IF(ISTEXT(A548),(HYPERLINK(SUBSTITUTE(HLINK(A548),\".aspx\",\"\")&IF(C$1=2013,\"(v=ocs.15).aspx\",\"(v=ocs.14).aspx\"),A548)),\"\")","v":"Set-CsClientVersionConfiguration"},{"$f":"IF(ISTEXT(B548),(HYPERLINK(SUBSTITUTE(HLINK(B548),\".aspx\",\"\")&IF(D$1=2013,\"(v=ocs.15).aspx\",\"(v=ocs.14).aspx\"),B548)),\"\")","v":"Set-CsClientVersionConfiguration"},"Modifies the specified collection of client version configuration settings. Client version configuration settings determine whether or not Microsoft Lync Server 2010 checks the version number of each client application that logs on to the system. If client version filtering is enabled, then the ability of that client application to access the system will be based on settings configured in the appropriate client version policy.","yes","no","no","no","no","no","yes","no","no","no","Get-CsAdminRole | ? {$_.Cmdlets –match \"Set-CsClientVersionConfiguration\"}"]
["Set-CsClientVersionPolicy","Set-CsClientVersionPolicy",{"$f":"IF(ISTEXT(A549),(HYPERLINK(SUBSTITUTE(HLINK(A549),\".aspx\",\"\")&IF(C$1=2013,\"(v=ocs.15).aspx\",\"(v=ocs.14).aspx\"),A549)),\"\")","v":"Set-CsClientVersionPolicy"},{"$f":"IF(ISTEXT(B549),(HYPERLINK(SUBSTITUTE(HLINK(B549),\".aspx\",\"\")&IF(D$1=2013,\"(v=ocs.15).aspx\",\"(v=ocs.14).aspx\"),B549)),\"\")","v":"Set-CsClientVersionPolicy"},"Modifies an existing client version policy. Client version policies enable you to specify which clients (such as Microsoft Office Communicator 2007 R2) will be allowed to log on to your Microsoft Lync Server 2010 system.","yes","no","no","no","no","no","yes","no","no","no","Get-CsAdminRole | ? {$_.Cmdlets –match \"Set-CsClientVersionPolicy\"}"]
["Set-CsClientVersionPolicyRule","Set-CsClientVersionPolicyRule",{"$f":"IF(ISTEXT(A550),(HYPERLINK(SUBSTITUTE(HLINK(A550),\".aspx\",\"\")&IF(C$1=2013,\"(v=ocs.15).aspx\",\"(v=ocs.14).aspx\"),A550)),\"\")","v":"Set-CsClientVersionPolicyRule"},{"$f":"IF(ISTEXT(B550),(HYPERLINK(SUBSTITUTE(HLINK(B550),\".aspx\",\"\")&IF(D$1=2013,\"(v=ocs.15).aspx\",\"(v=ocs.14).aspx\"),B550)),\"\")","v":"Set-CsClientVersionPolicyRule"},"Modifies one or more client version policy rules currently configured for use in your organization.","yes","no","no","no","no","no","yes","no","no","no","Get-CsAdminRole | ? {$_.Cmdlets –match \"Set-CsClientVersionPolicyRule\"}"]
[null,"Set-CsClsConfiguration",{"$f":"IF(ISTEXT(A551),(HYPERLINK(SUBSTITUTE(HLINK(A551),\".aspx\",\"\")&IF(C$1=2013,\"(v=ocs.15).aspx\",\"(v=ocs.14).aspx\"),A551)),\"\")","v":""},{"$f":"IF(ISTEXT(B551),(HYPERLINK(SUBSTITUTE(HLINK(B551),\".aspx\",\"\")&IF(D$1=2013,\"(v=ocs.15).aspx\",\"(v=ocs.14).aspx\"),B551)),\"\")","v":"Set-CsClsConfiguration"},"Modifies an existing collection of centralized logging configuration settings. Centralized logging provides a way for administrators to simultaneously enable or disable tracing on multiple computers. This cmdlet was introduced in Lync Server 2013.","yes","no","no","no","no","no","yes","no","no","no","Get-CsAdminRole | ? {$_.Cmdlets –match \"Set-CsClsConfiguration\"}"]
[null,"Set-CsClsRegion",{"$f":"IF(ISTEXT(A552),(HYPERLINK(SUBSTITUTE(HLINK(A552),\".aspx\",\"\")&IF(C$1=2013,\"(v=ocs.15).aspx\",\"(v=ocs.14).aspx\"),A552)),\"\")","v":""},{"$f":"IF(ISTEXT(B552),(HYPERLINK(SUBSTITUTE(HLINK(B552),\".aspx\",\"\")&IF(D$1=2013,\"(v=ocs.15).aspx\",\"(v=ocs.14).aspx\"),B552)),\"\")","v":"Set-CsClsRegion"},"Modifies an existing centralized logging configuration region. Centralized logging provides a way for administrators to simultaneously enable or disable event tracing on multiple computers. This cmdlet was introduced in Lync Server 2013.","yes","no","no","no","no","no","yes","no","no","no",{"$f":"\"Get-CsAdminRole | ? {$_.Cmdlets –match \"& CHAR(34) &B552& CHAR(34) &\"}\"","v":"Get-CsAdminRole | ? {$_.Cmdlets –match \"Set-CsClsRegion\"}"}]
[null,"Set-CsClsScenario",{"$f":"IF(ISTEXT(A553),(HYPERLINK(SUBSTITUTE(HLINK(A553),\".aspx\",\"\")&IF(C$1=2013,\"(v=ocs.15).aspx\",\"(v=ocs.14).aspx\"),A553)),\"\")","v":""},{"$f":"IF(ISTEXT(B553),(HYPERLINK(SUBSTITUTE(HLINK(B553),\".aspx\",\"\")&IF(D$1=2013,\"(v=ocs.15).aspx\",\"(v=ocs.14).aspx\"),B553)),\"\")","v":"Set-CsClsScenario"},"Enables you to modify a centralized logging configuration scenario. A scenario represents a particular Lync Server 2013 component or situation (such as IM and presence) that administrators can enable or disable for tracing. This cmdlet was introduced in Lync Server 2013.","yes","no","no","no","no","no","no","no","no","no","Get-CsAdminRole | ? {$_.Cmdlets –match \"Set-CsClsScenario\"}"]
[null,"Set-CsClsSearchTerm",{"$f":"IF(ISTEXT(A554),(HYPERLINK(SUBSTITUTE(HLINK(A554),\".aspx\",\"\")&IF(C$1=2013,\"(v=ocs.15).aspx\",\"(v=ocs.14).aspx\"),A554)),\"\")","v":""},{"$f":"IF(ISTEXT(B554),(HYPERLINK(SUBSTITUTE(HLINK(B554),\".aspx\",\"\")&IF(D$1=2013,\"(v=ocs.15).aspx\",\"(v=ocs.14).aspx\"),B554)),\"\")","v":"Set-CsClsSearchTerm"},"Modifies one or more centralized logging search terms. Search terms help define the personally identifiable information available to technical support personnel who are searching the centralized trace logs. Search terms are intended for use with Lync Online. This cmdlet was introduced in Lync Server 2013.","yes","no","no","no","no","no","yes","no","no","no","Get-CsAdminRole | ? {$_.Cmdlets –match \"Set-CsClsSearchTerm\"}"]
[null,"Set-CsClsSecurityGroup",{"$f":"IF(ISTEXT(A555),(HYPERLINK(SUBSTITUTE(HLINK(A555),\".aspx\",\"\")&IF(C$1=2013,\"(v=ocs.15).aspx\",\"(v=ocs.14).aspx\"),A555)),\"\")","v":""},{"$f":"IF(ISTEXT(B555),(HYPERLINK(SUBSTITUTE(HLINK(B555),\".aspx\",\"\")&IF(D$1=2013,\"(v=ocs.15).aspx\",\"(v=ocs.14).aspx\"),B555)),\"\")","v":"Set-CsClsSecurityGroup"},"Modifies a centralized logging configuration security group. Centralized logging provides a way for administrators to simultaneously enable or disable event tracing on multiple computers. This cmdlet was introduced in Lync Server 2013.","yes","no","no","no","no","no","yes","no","no","no","Get-CsAdminRole | ? {$_.Cmdlets –match \"Set-CsClsSecurityGroup\"}"]
["Set-CsCommonAreaPhone","Set-CsCommonAreaPhone",{"$f":"IF(ISTEXT(A556),(HYPERLINK(SUBSTITUTE(HLINK(A556),\".aspx\",\"\")&IF(C$1=2013,\"(v=ocs.15).aspx\",\"(v=ocs.14).aspx\"),A556)),\"\")","v":"Set-CsCommonAreaPhone"},{"$f":"IF(ISTEXT(B556),(HYPERLINK(SUBSTITUTE(HLINK(B556),\".aspx\",\"\")&IF(D$1=2013,\"(v=ocs.15).aspx\",\"(v=ocs.14).aspx\"),B556)),\"\")","v":"Set-CsCommonAreaPhone"},"Modifies the property values of a common area phone managed by Microsoft Lync Server 2010. Common area phones are phones that are located in building lobbies, employee lounges, or other areas where they are likely to be used by a number of different people and for a number of different uses.","yes","no","no","no","no","no","yes","yes","no","yes","Get-CsAdminRole | ? {$_.Cmdlets –match \"Set-CsCommonAreaPhone\"}"]
["Set-CsConferenceDisclaimer","Set-CsConferenceDisclaimer",{"$f":"IF(ISTEXT(A557),(HYPERLINK(SUBSTITUTE(HLINK(A557),\".aspx\",\"\")&IF(C$1=2013,\"(v=ocs.15).aspx\",\"(v=ocs.14).aspx\"),A557)),\"\")","v":"Set-CsConferenceDisclaimer"},{"$f":"IF(ISTEXT(B557),(HYPERLINK(SUBSTITUTE(HLINK(B557),\".aspx\",\"\")&IF(D$1=2013,\"(v=ocs.15).aspx\",\"(v=ocs.14).aspx\"),B557)),\"\")","v":"Set-CsConferenceDisclaimer"},"Modifies the property values of the conference disclaimer used in your organization. The conference disclaimer is a message displayed to users who join a conference by using a hyperlink (for example, by pasting a link to the conference into a browser such as Windows Internet Explorer).","yes","no","no","no","no","no","yes","no","no","no","Get-CsAdminRole | ? {$_.Cmdlets –match \"Set-CsConferenceDisclaimer\"}"]
["Set-CsConferenceServer","Set-CsConferenceServer",{"$f":"IF(ISTEXT(A558),(HYPERLINK(SUBSTITUTE(HLINK(A558),\".aspx\",\"\")&IF(C$1=2013,\"(v=ocs.15).aspx\",\"(v=ocs.14).aspx\"),A558)),\"\")","v":"Set-CsConferenceServer"},{"$f":"IF(ISTEXT(B558),(HYPERLINK(SUBSTITUTE(HLINK(B558),\".aspx\",\"\")&IF(D$1=2013,\"(v=ocs.15).aspx\",\"(v=ocs.14).aspx\"),B558)),\"\")","v":"Set-CsConferenceServer"},"Modifies the properties of an A/V Conferencing Server (also known as a Conference Server). The Conference Server provides audio and video (A/V) capabilities to your conferences.","yes","no","no","no","no","no","yes","no","no","no","Get-CsAdminRole | ? {$_.Cmdlets –match \"Set-CsConferenceServer\"}"]
["Set-CsConferencingConfiguration","Set-CsConferencingConfiguration",{"$f":"IF(ISTEXT(A559),(HYPERLINK(SUBSTITUTE(HLINK(A559),\".aspx\",\"\")&IF(C$1=2013,\"(v=ocs.15).aspx\",\"(v=ocs.14).aspx\"),A559)),\"\")","v":"Set-CsConferencingConfiguration"},{"$f":"IF(ISTEXT(B559),(HYPERLINK(SUBSTITUTE(HLINK(B559),\".aspx\",\"\")&IF(D$1=2013,\"(v=ocs.15).aspx\",\"(v=ocs.14).aspx\"),B559)),\"\")","v":"Set-CsConferencingConfiguration"},"Modifies an existing collection of conferencing configuration settings. Conference settings determine such things as the maximum allowed size for meeting content and handouts; the content grace period (that is, the amount of time content will be stored before being deleted); and the URLs for the internal and external downloads of the supported client.","yes","no","no","no","no","no","yes","no","no","no","Get-CsAdminRole | ? {$_.Cmdlets –match \"Set-CsConferencingConfiguration\"}"]
["Set-CsConferencingPolicy","Set-CsConferencingPolicy",{"$f":"IF(ISTEXT(A560),(HYPERLINK(SUBSTITUTE(HLINK(A560),\".aspx\",\"\")&IF(C$1=2013,\"(v=ocs.15).aspx\",\"(v=ocs.14).aspx\"),A560)),\"\")","v":"Set-CsConferencingPolicy"},{"$f":"IF(ISTEXT(B560),(HYPERLINK(SUBSTITUTE(HLINK(B560),\".aspx\",\"\")&IF(D$1=2013,\"(v=ocs.15).aspx\",\"(v=ocs.14).aspx\"),B560)),\"\")","v":"Set-CsConferencingPolicy"},"Modifies an existing conferencing policy. Conferencing policies determine the features and capabilities that can be used in a conference; this includes everything from whether or not the conference can include IP audio and video to the maximum number of people who can attend a meeting.","yes","no","no","no","no","no","yes","no","no","no","Get-CsAdminRole | ? {$_.Cmdlets –match \"Set-CsConferencingPolicy\"}"]
["Set-CsConfigurationStoreLocation","Set-CsConfigurationStoreLocation",{"$f":"IF(ISTEXT(A561),(HYPERLINK(SUBSTITUTE(HLINK(A561),\".aspx\",\"\")&IF(C$1=2013,\"(v=ocs.15).aspx\",\"(v=ocs.14).aspx\"),A561)),\"\")","v":"Set-CsConfigurationStoreLocation"},{"$f":"IF(ISTEXT(B561),(HYPERLINK(SUBSTITUTE(HLINK(B561),\".aspx\",\"\")&IF(D$1=2013,\"(v=ocs.15).aspx\",\"(v=ocs.14).aspx\"),B561)),\"\")","v":"Set-CsConfigurationStoreLocation"},"Sets the Active Directory service control point for the Central Management store.","no","no","no","no","no","no","no","no","no","no","Get-CsAdminRole | ? {$_.Cmdlets –match \"Set-CsConfigurationStoreLocation\"}"]
["Set-CsCpsConfiguration","Set-CsCpsConfiguration",{"$f":"IF(ISTEXT(A562),(HYPERLINK(SUBSTITUTE(HLINK(A562),\".aspx\",\"\")&IF(C$1=2013,\"(v=ocs.15).aspx\",\"(v=ocs.14).aspx\"),A562)),\"\")","v":"Set-CsCpsConfiguration"},{"$f":"IF(ISTEXT(B562),(HYPERLINK(SUBSTITUTE(HLINK(B562),\".aspx\",\"\")&IF(D$1=2013,\"(v=ocs.15).aspx\",\"(v=ocs.14).aspx\"),B562)),\"\")","v":"Set-CsCpsConfiguration"},"Modifies an existing collection of Call Park service settings. Call parking is a service that allows a user to \"park\" an incoming phone call. Parking a call transfers it to a number in a specified range, or orbit, and then immediately places the call on hold. Anyone (not just the person who originally answered the call) can resume the conversation from any telephone simply by entering the correct number.","yes","no","no","no","no","no","yes","no","no","yes","Get-CsAdminRole | ? {$_.Cmdlets –match \"Set-CsCpsConfiguration\"}"]
["Set-CsDeviceUpdateConfiguration","Set-CsDeviceUpdateConfiguration",{"$f":"IF(ISTEXT(A563),(HYPERLINK(SUBSTITUTE(HLINK(A563),\".aspx\",\"\")&IF(C$1=2013,\"(v=ocs.15).aspx\",\"(v=ocs.14).aspx\"),A563)),\"\")","v":"Set-CsDeviceUpdateConfiguration"},{"$f":"IF(ISTEXT(B563),(HYPERLINK(SUBSTITUTE(HLINK(B563),\".aspx\",\"\")&IF(D$1=2013,\"(v=ocs.15).aspx\",\"(v=ocs.14).aspx\"),B563)),\"\")","v":"Set-CsDeviceUpdateConfiguration"},"Modifies a collection of Device Update Web service configuration settings. These settings are used to manage the Device Update Web service, a Microsoft Lync Server 2010 component that enables administrators to distribute firmware updates to telephones and other devices running Microsoft Lync 2010 Phone Edition.","yes","no","no","no","no","no","yes","no","no","yes","Get-CsAdminRole | ? {$_.Cmdlets –match \"Set-CsDeviceUpdateConfiguration\"}"]
["Set-CsDiagnosticConfiguration","Set-CsDiagnosticConfiguration",{"$f":"IF(ISTEXT(A564),(HYPERLINK(SUBSTITUTE(HLINK(A564),\".aspx\",\"\")&IF(C$1=2013,\"(v=ocs.15).aspx\",\"(v=ocs.14).aspx\"),A564)),\"\")","v":"Set-CsDiagnosticConfiguration"},{"$f":"IF(ISTEXT(B564),(HYPERLINK(SUBSTITUTE(HLINK(B564),\".aspx\",\"\")&IF(D$1=2013,\"(v=ocs.15).aspx\",\"(v=ocs.14).aspx\"),B564)),\"\")","v":"Set-CsDiagnosticConfiguration"},"Modifies existing diagnostic configuration settings. Diagnostic configuration settings are used to determine whether traffic to or from a given domain or Uniform Resource Identifier (URI) is recorded in your Microsoft Lync Server 2010 log files.","yes","no","no","no","no","no","yes","no","no","no","Get-CsAdminRole | ? {$_.Cmdlets –match \"Set-CsDiagnosticConfiguration\"}"]
["Set-CsDiagnosticHeaderConfiguration","Set-CsDiagnosticHeaderConfiguration",{"$f":"IF(ISTEXT(A565),(HYPERLINK(SUBSTITUTE(HLINK(A565),\".aspx\",\"\")&IF(C$1=2013,\"(v=ocs.15).aspx\",\"(v=ocs.14).aspx\"),A565)),\"\")","v":"Set-CsDiagnosticHeaderConfiguration"},{"$f":"IF(ISTEXT(B565),(HYPERLINK(SUBSTITUTE(HLINK(B565),\".aspx\",\"\")&IF(D$1=2013,\"(v=ocs.15).aspx\",\"(v=ocs.14).aspx\"),B565)),\"\")","v":"Set-CsDiagnosticHeaderConfiguration"},"Modifies an existing diagnostic header configuration setting collection currently in use in your organization. Diagnostic header configuration settings determine whether SIP messages are accompanied by header information that can be useful in troubleshooting and error reporting.","yes","no","no","no","no","no","yes","no","no","no","Get-CsAdminRole | ? {$_.Cmdlets –match \"Set-CsDiagnosticHeaderConfiguration\"}"]
["Set-CsDialInConferencingAccessNumber","Set-CsDialInConferencingAccessNumber",{"$f":"IF(ISTEXT(A566),(HYPERLINK(SUBSTITUTE(HLINK(A566),\".aspx\",\"\")&IF(C$1=2013,\"(v=ocs.15).aspx\",\"(v=ocs.14).aspx\"),A566)),\"\")","v":"Set-CsDialInConferencingAccessNumber"},{"$f":"IF(ISTEXT(B566),(HYPERLINK(SUBSTITUTE(HLINK(B566),\".aspx\",\"\")&IF(D$1=2013,\"(v=ocs.15).aspx\",\"(v=ocs.14).aspx\"),B566)),\"\")","v":"Set-CsDialInConferencingAccessNumber"},"Modifies the property values of an existing dial-in conferencing access number. Dial-in conferencing provides a way for users to use a \"regular\" telephone, mobile phone or other device on the public switched telephone network (PSTN) to join the audio portion of a conference.","yes","no","no","no","no","no","yes","no","no","no","Get-CsAdminRole | ? {$_.Cmdlets –match \"Set-CsDialInConferencingAccessNumber\"}"]
["Set-CsDialInConferencingConfiguration","Set-CsDialInConferencingConfiguration",{"$f":"IF(ISTEXT(A567),(HYPERLINK(SUBSTITUTE(HLINK(A567),\".aspx\",\"\")&IF(C$1=2013,\"(v=ocs.15).aspx\",\"(v=ocs.14).aspx\"),A567)),\"\")","v":"Set-CsDialInConferencingConfiguration"},{"$f":"IF(ISTEXT(B567),(HYPERLINK(SUBSTITUTE(HLINK(B567),\".aspx\",\"\")&IF(D$1=2013,\"(v=ocs.15).aspx\",\"(v=ocs.14).aspx\"),B567)),\"\")","v":"Set-CsDialInConferencingConfiguration"},"Modifies settings that determine how Microsoft Lync Server 2010 responds when users join or leave a dial-in conference.","yes","no","no","no","no","no","yes","no","no","no","Get-CsAdminRole | ? {$_.Cmdlets –match \"Set-CsDialInConferencingConfiguration\"}"]
["Set-CsDialInConferencingDtmfConfiguration","Set-CsDialInConferencingDtmfConfiguration",{"$f":"IF(ISTEXT(A568),(HYPERLINK(SUBSTITUTE(HLINK(A568),\".aspx\",\"\")&IF(C$1=2013,\"(v=ocs.15).aspx\",\"(v=ocs.14).aspx\"),A568)),\"\")","v":"Set-CsDialInConferencingDtmfConfiguration"},{"$f":"IF(ISTEXT(B568),(HYPERLINK(SUBSTITUTE(HLINK(B568),\".aspx\",\"\")&IF(D$1=2013,\"(v=ocs.15).aspx\",\"(v=ocs.14).aspx\"),B568)),\"\")","v":"Set-CsDialInConferencingDtmfConfiguration"},"Modifies the dual-tone multifrequency (DTMF) signaling settings used for dial-in conferencing. DTMF enables users who dial in to a conference to control conference settings (such as muting and unmuting themselves or locking and unlocking the conference) by using the keypad on their telephone.","yes","no","no","no","no","no","yes","no","no","no","Get-CsAdminRole | ? {$_.Cmdlets –match \"Set-CsDialInConferencingDtmfConfiguration\"}"]
["Set-CsDialPlan","Set-CsDialPlan",{"$f":"IF(ISTEXT(A569),(HYPERLINK(SUBSTITUTE(HLINK(A569),\".aspx\",\"\")&IF(C$1=2013,\"(v=ocs.15).aspx\",\"(v=ocs.14).aspx\"),A569)),\"\")","v":"Set-CsDialPlan"},{"$f":"IF(ISTEXT(B569),(HYPERLINK(SUBSTITUTE(HLINK(B569),\".aspx\",\"\")&IF(D$1=2013,\"(v=ocs.15).aspx\",\"(v=ocs.14).aspx\"),B569)),\"\")","v":"Set-CsDialPlan"},"Modifies an existing dial plan.","yes","no","no","no","no","no","yes","no","no","yes","Get-CsAdminRole | ? {$_.Cmdlets –match \"Set-CsDialPlan\"}"]
["Set-CsDirector","Set-CsDirector",{"$f":"IF(ISTEXT(A570),(HYPERLINK(SUBSTITUTE(HLINK(A570),\".aspx\",\"\")&IF(C$1=2013,\"(v=ocs.15).aspx\",\"(v=ocs.14).aspx\"),A570)),\"\")","v":"Set-CsDirector"},{"$f":"IF(ISTEXT(B570),(HYPERLINK(SUBSTITUTE(HLINK(B570),\".aspx\",\"\")&IF(D$1=2013,\"(v=ocs.15).aspx\",\"(v=ocs.14).aspx\"),B570)),\"\")","v":"Set-CsDirector"},"Modifies the properties of one or more Directors. Directors can be used to authenticate user requests, but do not host user accounts.","yes","no","no","no","no","no","yes","no","no","no","Get-CsAdminRole | ? {$_.Cmdlets –match \"Set-CsDirector\"}"]
["Set-CsEdgeServer","Set-CsEdgeServer",{"$f":"IF(ISTEXT(A571),(HYPERLINK(SUBSTITUTE(HLINK(A571),\".aspx\",\"\")&IF(C$1=2013,\"(v=ocs.15).aspx\",\"(v=ocs.14).aspx\"),A571)),\"\")","v":"Set-CsEdgeServer"},{"$f":"IF(ISTEXT(B571),(HYPERLINK(SUBSTITUTE(HLINK(B571),\".aspx\",\"\")&IF(D$1=2013,\"(v=ocs.15).aspx\",\"(v=ocs.14).aspx\"),B571)),\"\")","v":"Set-CsEdgeServer"},"Modifies the property values for one or more Edge Servers. Edge Servers are used to provide connectivity between your internal network and the Internet.","yes","no","no","no","no","no","yes","no","no","no","Get-CsAdminRole | ? {$_.Cmdlets –match \"Set-CsEdgeServer\"}"]
["Set-CsEnhancedEmergencyServiceDisclaimer","Set-CsEnhancedEmergencyServiceDisclaimer",{"$f":"IF(ISTEXT(A572),(HYPERLINK(SUBSTITUTE(HLINK(A572),\".aspx\",\"\")&IF(C$1=2013,\"(v=ocs.15).aspx\",\"(v=ocs.14).aspx\"),A572)),\"\")","v":"Set-CsEnhancedEmergencyServiceDisclaimer"},{"$f":"IF(ISTEXT(B572),(HYPERLINK(SUBSTITUTE(HLINK(B572),\".aspx\",\"\")&IF(D$1=2013,\"(v=ocs.15).aspx\",\"(v=ocs.14).aspx\"),B572)),\"\")","v":"Set-CsEnhancedEmergencyServiceDisclaimer"},"Sets disclaimer text that will be used globally to prompt for location information for an Enhanced 9-1-1 (E9-1-1) implementation.","yes","no","no","no","no","no","yes","no","no","yes","Get-CsAdminRole | ? {$_.Cmdlets –match \"Set-CsEnhancedEmergencyServiceDisclaimer\"}"]
["Set-CsExternalAccessPolicy","Set-CsExternalAccessPolicy",{"$f":"IF(ISTEXT(A573),(HYPERLINK(SUBSTITUTE(HLINK(A573),\".aspx\",\"\")&IF(C$1=2013,\"(v=ocs.15).aspx\",\"(v=ocs.14).aspx\"),A573)),\"\")","v":"Set-CsExternalAccessPolicy"},{"$f":"IF(ISTEXT(B573),(HYPERLINK(SUBSTITUTE(HLINK(B573),\".aspx\",\"\")&IF(D$1=2013,\"(v=ocs.15).aspx\",\"(v=ocs.14).aspx\"),B573)),\"\")","v":"Set-CsExternalAccessPolicy"},"Enables you to modify the properties of an existing external access policy. External access policies determine whether or not your users can: 1) communicate with users who have Session Initiation Protocol (SIP) accounts with a federated organization; 2) communicate with users who have SIP accounts with a public instant messaging (IM) provider such as MSN; and, 3) access Microsoft Lync Server 2010 over the Internet, without having to log on to your internal network.","yes","no","no","no","no","no","yes","no","no","no","Get-CsAdminRole | ? {$_.Cmdlets –match \"Set-CsExternalAccessPolicy\"}",{"$f":"HYPERLINK(B573)","v":"Set-CsExternalAccessPolicy"}]
["Set-CsExUmContact","Set-CsExUmContact",{"$f":"IF(ISTEXT(A574),(HYPERLINK(SUBSTITUTE(HLINK(A574),\".aspx\",\"\")&IF(C$1=2013,\"(v=ocs.15).aspx\",\"(v=ocs.14).aspx\"),A574)),\"\")","v":"Set-CsExUmContact"},{"$f":"IF(ISTEXT(B574),(HYPERLINK(SUBSTITUTE(HLINK(B574),\".aspx\",\"\")&IF(D$1=2013,\"(v=ocs.15).aspx\",\"(v=ocs.14).aspx\"),B574)),\"\")","v":"Set-CsExUmContact"},"Modifies an existing Auto Attendant or Subscriber Access contact object for hosted Exchange Unified Messaging (UM).","yes","no","no","no","no","no","yes","yes","no","yes","Get-CsAdminRole | ? {$_.Cmdlets –match \"Set-CsExUmContact\"}"]
["Set-CsFileTransferFilterConfiguration","Set-CsFileTransferFilterConfiguration",{"$f":"IF(ISTEXT(A575),(HYPERLINK(SUBSTITUTE(HLINK(A575),\".aspx\",\"\")&IF(C$1=2013,\"(v=ocs.15).aspx\",\"(v=ocs.14).aspx\"),A575)),\"\")","v":"Set-CsFileTransferFilterConfiguration"},{"$f":"IF(ISTEXT(B575),(HYPERLINK(SUBSTITUTE(HLINK(B575),\".aspx\",\"\")&IF(D$1=2013,\"(v=ocs.15).aspx\",\"(v=ocs.14).aspx\"),B575)),\"\")","v":"Set-CsFileTransferFilterConfiguration"},"Modifies a collection of file transfer filter configuration settings. File transfer filter settings are used to block a user's ability to transfer certain types of files (for example, files with a .vbs or .ps1 file extension) by using Microsoft Lync Server 2010 clients.","yes","no","no","no","no","no","yes","no","no","no","Get-CsAdminRole | ? {$_.Cmdlets –match \"Set-CsFileTransferFilterConfiguration\"}"]
[null,"Set-CsFIPSConfiguration",{"$f":"IF(ISTEXT(A576),(HYPERLINK(SUBSTITUTE(HLINK(A576),\".aspx\",\"\")&IF(C$1=2013,\"(v=ocs.15).aspx\",\"(v=ocs.14).aspx\"),A576)),\"\")","v":""},{"$f":"IF(ISTEXT(B576),(HYPERLINK(SUBSTITUTE(HLINK(B576),\".aspx\",\"\")&IF(D$1=2013,\"(v=ocs.15).aspx\",\"(v=ocs.14).aspx\"),B576)),\"\")","v":"Set-CsFIPSConfiguration"},"Modifies an existing collection of Federal Information Processing Standards (FIPS) configuration settings. The FIPS standards are a set of United States government security standards required for use in computers maintained by non-military government agencies and by government contractors. This cmdlet was introduced in Lync Server 2013.","yes","no","no","no","no","no","yes","no","no","no","Get-CsAdminRole | ? {$_.Cmdlets –match \"Set-CsFIPSConfiguration\"}"]
["Set-CsHealthMonitoringConfiguration","Set-CsHealthMonitoringConfiguration",{"$f":"IF(ISTEXT(A577),(HYPERLINK(SUBSTITUTE(HLINK(A577),\".aspx\",\"\")&IF(C$1=2013,\"(v=ocs.15).aspx\",\"(v=ocs.14).aspx\"),A577)),\"\")","v":"Set-CsHealthMonitoringConfiguration"},{"$f":"IF(ISTEXT(B577),(HYPERLINK(SUBSTITUTE(HLINK(B577),\".aspx\",\"\")&IF(D$1=2013,\"(v=ocs.15).aspx\",\"(v=ocs.14).aspx\"),B577)),\"\")","v":"Set-CsHealthMonitoringConfiguration"},"Modifies an existing collection of health monitoring configuration settings. These settings enable administrators to run quality assurance tests without having to supply the user names and passwords for the required test accounts.","yes","no","no","no","no","no","yes","no","no","no","Get-CsAdminRole | ? {$_.Cmdlets –match \"Set-CsHealthMonitoringConfiguration\"}"]
["Set-CsHostedVoicemailPolicy","Set-CsHostedVoicemailPolicy",{"$f":"IF(ISTEXT(A578),(HYPERLINK(SUBSTITUTE(HLINK(A578),\".aspx\",\"\")&IF(C$1=2013,\"(v=ocs.15).aspx\",\"(v=ocs.14).aspx\"),A578)),\"\")","v":"Set-CsHostedVoicemailPolicy"},{"$f":"IF(ISTEXT(B578),(HYPERLINK(SUBSTITUTE(HLINK(B578),\".aspx\",\"\")&IF(D$1=2013,\"(v=ocs.15).aspx\",\"(v=ocs.14).aspx\"),B578)),\"\")","v":"Set-CsHostedVoicemailPolicy"},"Modifies a hosted voice mail policy.","yes","no","no","no","no","no","yes","no","no","yes","Get-CsAdminRole | ? {$_.Cmdlets –match \"Set-CsHostedVoicemailPolicy\"}"]
["Set-CsHostingProvider","Set-CsHostingProvider",{"$f":"IF(ISTEXT(A579),(HYPERLINK(SUBSTITUTE(HLINK(A579),\".aspx\",\"\")&IF(C$1=2013,\"(v=ocs.15).aspx\",\"(v=ocs.14).aspx\"),A579)),\"\")","v":"Set-CsHostingProvider"},{"$f":"IF(ISTEXT(B579),(HYPERLINK(SUBSTITUTE(HLINK(B579),\".aspx\",\"\")&IF(D$1=2013,\"(v=ocs.15).aspx\",\"(v=ocs.14).aspx\"),B579)),\"\")","v":"Set-CsHostingProvider"},"Modifies a hosting provider currently in use in your organization. A hosting provider is a third-party organization that provides instant messaging, presence, and related services for a domain that you would like to federate with. Hosting providers, such as Microsoft Lync Online 2010, differ from public providers (such as Yahoo!, MSN, and AOL) in that their services are not offered to the general public.","yes","no","no","no","no","no","yes","no","no","no","Get-CsAdminRole | ? {$_.Cmdlets –match \"Set-CsHostingProvider\"}"]
["Set-CsImFilterConfiguration","Set-CsImFilterConfiguration",{"$f":"IF(ISTEXT(A580),(HYPERLINK(SUBSTITUTE(HLINK(A580),\".aspx\",\"\")&IF(C$1=2013,\"(v=ocs.15).aspx\",\"(v=ocs.14).aspx\"),A580)),\"\")","v":"Set-CsImFilterConfiguration"},{"$f":"IF(ISTEXT(B580),(HYPERLINK(SUBSTITUTE(HLINK(B580),\".aspx\",\"\")&IF(D$1=2013,\"(v=ocs.15).aspx\",\"(v=ocs.14).aspx\"),B580)),\"\")","v":"Set-CsImFilterConfiguration"},"Modifies an existing instant messaging (IM) filter configuration. IM filter settings are used to prevent users from sending instant messages that contain live (clickable) hyperlinks.","yes","no","no","no","no","no","yes","no","no","no","Get-CsAdminRole | ? {$_.Cmdlets –match \"Set-CsImFilterConfiguration\"}"]
["Set-CsKerberosAccountAssignment","Set-CsKerberosAccountAssignment",{"$f":"IF(ISTEXT(A581),(HYPERLINK(SUBSTITUTE(HLINK(A581),\".aspx\",\"\")&IF(C$1=2013,\"(v=ocs.15).aspx\",\"(v=ocs.14).aspx\"),A581)),\"\")","v":"Set-CsKerberosAccountAssignment"},{"$f":"IF(ISTEXT(B581),(HYPERLINK(SUBSTITUTE(HLINK(B581),\".aspx\",\"\")&IF(D$1=2013,\"(v=ocs.15).aspx\",\"(v=ocs.14).aspx\"),B581)),\"\")","v":"Set-CsKerberosAccountAssignment"},"Associates a Kerberos account, which is used for IIS Internet Information Services (IIS) authentication, with a site.","no","no","no","no","no","no","no","no","no","no","Get-CsAdminRole | ? {$_.Cmdlets –match \"Set-CsKerberosAccountAssignment\"}"]
["Set-CsKerberosAccountPassword","Set-CsKerberosAccountPassword",{"$f":"IF(ISTEXT(A582),(HYPERLINK(SUBSTITUTE(HLINK(A582),\".aspx\",\"\")&IF(C$1=2013,\"(v=ocs.15).aspx\",\"(v=ocs.14).aspx\"),A582)),\"\")","v":"Set-CsKerberosAccountPassword"},{"$f":"IF(ISTEXT(B582),(HYPERLINK(SUBSTITUTE(HLINK(B582),\".aspx\",\"\")&IF(D$1=2013,\"(v=ocs.15).aspx\",\"(v=ocs.14).aspx\"),B582)),\"\")","v":"Set-CsKerberosAccountPassword"},"Locates each server running Web Services in a site that has been assigned a Kerberos account, and then updates the Internet Information Services (IIS) configuration settings on each of those servers.","no","no","no","no","no","no","no","no","no","no","Get-CsAdminRole | ? {$_.Cmdlets –match \"Set-CsKerberosAccountPassword\"}"]
["Set-CsLisLocation","Set-CsLisLocation",{"$f":"IF(ISTEXT(A583),(HYPERLINK(SUBSTITUTE(HLINK(A583),\".aspx\",\"\")&IF(C$1=2013,\"(v=ocs.15).aspx\",\"(v=ocs.14).aspx\"),A583)),\"\")","v":"Set-CsLisLocation"},{"$f":"IF(ISTEXT(B583),(HYPERLINK(SUBSTITUTE(HLINK(B583),\".aspx\",\"\")&IF(D$1=2013,\"(v=ocs.15).aspx\",\"(v=ocs.14).aspx\"),B583)),\"\")","v":"Set-CsLisLocation"},"Creates a new location or modifies an existing location in the location configuration database for Enhanced 9-1-1 (E9-1-1).","yes","no","no","yes","no","no","yes","no","no","yes","Get-CsAdminRole | ? {$_.Cmdlets –match \"Set-CsLisLocation\"}"]
["Set-CsLisPort","Set-CsLisPort",{"$f":"IF(ISTEXT(A584),(HYPERLINK(SUBSTITUTE(HLINK(A584),\".aspx\",\"\")&IF(C$1=2013,\"(v=ocs.15).aspx\",\"(v=ocs.14).aspx\"),A584)),\"\")","v":"Set-CsLisPort"},{"$f":"IF(ISTEXT(B584),(HYPERLINK(SUBSTITUTE(HLINK(B584),\".aspx\",\"\")&IF(D$1=2013,\"(v=ocs.15).aspx\",\"(v=ocs.14).aspx\"),B584)),\"\")","v":"Set-CsLisPort"},"Creates a Location Information Server (LIS) port, creates an association between a port and a location (creating a new location if that location doesn't exist), or modifies an existing port and its associated location. The association between a port and location is used in an Enhanced 9-1-1 (E9-1-1) Enterprise Voice implementation to notify an emergency services operator of the caller's location.","yes","no","no","yes","no","no","yes","no","no","yes","Get-CsAdminRole | ? {$_.Cmdlets –match \"Set-CsLisPort\"}"]
["Set-CsLisServiceProvider","Set-CsLisServiceProvider",{"$f":"IF(ISTEXT(A585),(HYPERLINK(SUBSTITUTE(HLINK(A585),\".aspx\",\"\")&IF(C$1=2013,\"(v=ocs.15).aspx\",\"(v=ocs.14).aspx\"),A585)),\"\")","v":"Set-CsLisServiceProvider"},{"$f":"IF(ISTEXT(B585),(HYPERLINK(SUBSTITUTE(HLINK(B585),\".aspx\",\"\")&IF(D$1=2013,\"(v=ocs.15).aspx\",\"(v=ocs.14).aspx\"),B585)),\"\")","v":"Set-CsLisServiceProvider"},"Creates or modifies information about the web service provided by the Enhanced 9-1-1 (E9-1-1) Network Routing Provider to verify locations.","yes","no","no","no","no","no","yes","no","no","yes","Get-CsAdminRole | ? {$_.Cmdlets –match \"Set-CsLisServiceProvider\"}"]
["Set-CsLisSubnet","Set-CsLisSubnet",{"$f":"IF(ISTEXT(A586),(HYPERLINK(SUBSTITUTE(HLINK(A586),\".aspx\",\"\")&IF(C$1=2013,\"(v=ocs.15).aspx\",\"(v=ocs.14).aspx\"),A586)),\"\")","v":"Set-CsLisSubnet"},{"$f":"IF(ISTEXT(B586),(HYPERLINK(SUBSTITUTE(HLINK(B586),\".aspx\",\"\")&IF(D$1=2013,\"(v=ocs.15).aspx\",\"(v=ocs.14).aspx\"),B586)),\"\")","v":"Set-CsLisSubnet"},"Creates a Location Information Server (LIS) subnet, creates an association between a subnet and a location (creating a new location if that location doesn't exist), or modifies an existing subnet and its associated location. The association between a subnet and location is used in an Enhanced 9-1-1 (E9-1-1) Enterprise Voice implementation to notify an emergency services operator of the caller's location.","yes","no","no","yes","no","no","yes","no","no","yes","Get-CsAdminRole | ? {$_.Cmdlets –match \"Set-CsLisSubnet\"}"]
["Set-CsLisSwitch","Set-CsLisSwitch",{"$f":"IF(ISTEXT(A587),(HYPERLINK(SUBSTITUTE(HLINK(A587),\".aspx\",\"\")&IF(C$1=2013,\"(v=ocs.15).aspx\",\"(v=ocs.14).aspx\"),A587)),\"\")","v":"Set-CsLisSwitch"},{"$f":"IF(ISTEXT(B587),(HYPERLINK(SUBSTITUTE(HLINK(B587),\".aspx\",\"\")&IF(D$1=2013,\"(v=ocs.15).aspx\",\"(v=ocs.14).aspx\"),B587)),\"\")","v":"Set-CsLisSwitch"},"Creates a Location Information Server (LIS) switch, creates an association between a switch and a location (creating a new location if that location doesn't exist), or modifies an existing switch and its associated location. The association between a switch and location is used in an Enhanced 9-1-1 (E9-1-1) Enterprise Voice implementation to notify an emergency services operator of the caller's location.","yes","no","no","yes","no","no","yes","no","no","yes","Get-CsAdminRole | ? {$_.Cmdlets –match \"Set-CsLisSwitch\"}"]
["Set-CsLisWirelessAccessPoint","Set-CsLisWirelessAccessPoint",{"$f":"IF(ISTEXT(A588),(HYPERLINK(SUBSTITUTE(HLINK(A588),\".aspx\",\"\")&IF(C$1=2013,\"(v=ocs.15).aspx\",\"(v=ocs.14).aspx\"),A588)),\"\")","v":"Set-CsLisWirelessAccessPoint"},{"$f":"IF(ISTEXT(B588),(HYPERLINK(SUBSTITUTE(HLINK(B588),\".aspx\",\"\")&IF(D$1=2013,\"(v=ocs.15).aspx\",\"(v=ocs.14).aspx\"),B588)),\"\")","v":"Set-CsLisWirelessAccessPoint"},"Creates a Location Information Server (LIS) wireless access point (WAP), creates an association between a WAP and a location (creating a new location if that location doesn't exist), or modifies an existing WAP and its associated location. The association between a WAP and location is used in an Enhanced 9-1-1 (E9-1-1) Enterprise Voice implementation to notify an emergency services operator of the caller's location.","yes","no","no","yes","no","no","yes","no","no","yes","Get-CsAdminRole | ? {$_.Cmdlets –match \"Set-CsLisWirelessAccessPoint\"}"]
["Set-CsLocationPolicy","Set-CsLocationPolicy",{"$f":"IF(ISTEXT(A589),(HYPERLINK(SUBSTITUTE(HLINK(A589),\".aspx\",\"\")&IF(C$1=2013,\"(v=ocs.15).aspx\",\"(v=ocs.14).aspx\"),A589)),\"\")","v":"Set-CsLocationPolicy"},{"$f":"IF(ISTEXT(B589),(HYPERLINK(SUBSTITUTE(HLINK(B589),\".aspx\",\"\")&IF(D$1=2013,\"(v=ocs.15).aspx\",\"(v=ocs.14).aspx\"),B589)),\"\")","v":"Set-CsLocationPolicy"},"Modifies an existing location policy.","yes","no","no","no","no","no","yes","no","no","yes","Get-CsAdminRole | ? {$_.Cmdlets –match \"Set-CsLocationPolicy\"}"]
["Set-CsManagementConnection","Set-CsManagementConnection",{"$f":"IF(ISTEXT(A590),(HYPERLINK(SUBSTITUTE(HLINK(A590),\".aspx\",\"\")&IF(C$1=2013,\"(v=ocs.15).aspx\",\"(v=ocs.14).aspx\"),A590)),\"\")","v":"Set-CsManagementConnection"},{"$f":"IF(ISTEXT(B590),(HYPERLINK(SUBSTITUTE(HLINK(B590),\".aspx\",\"\")&IF(D$1=2013,\"(v=ocs.15).aspx\",\"(v=ocs.14).aspx\"),B590)),\"\")","v":"Set-CsManagementConnection"},"Modifies the management connection to the Central Management store.","yes","no","no","no","no","no","yes","no","no","no","Get-CsAdminRole | ? {$_.Cmdlets –match \"Set-CsManagementConnection\"}"]
["Set-CsManagementServer","Set-CsManagementServer",{"$f":"IF(ISTEXT(A591),(HYPERLINK(SUBSTITUTE(HLINK(A591),\".aspx\",\"\")&IF(C$1=2013,\"(v=ocs.15).aspx\",\"(v=ocs.14).aspx\"),A591)),\"\")","v":"Set-CsManagementServer"},{"$f":"IF(ISTEXT(B591),(HYPERLINK(SUBSTITUTE(HLINK(B591),\".aspx\",\"\")&IF(D$1=2013,\"(v=ocs.15).aspx\",\"(v=ocs.14).aspx\"),B591)),\"\")","v":"Set-CsManagementServer"},"Modifies the replication port used by the Lync Server Central Management service. This cmdlet was introduced in Lync Server 2010.","yes","no","no","no","no","no","yes","no","no","no",{"$f":"\"Get-CsAdminRole | ? {$_.Cmdlets –match \"& CHAR(34) &B591& CHAR(34) &\"}\"","v":"Get-CsAdminRole | ? {$_.Cmdlets –match \"Set-CsManagementServer\"}"}]
["Set-CsMcxConfiguration","Set-CsMcxConfiguration",{"$f":"IF(ISTEXT(A592),(HYPERLINK(SUBSTITUTE(HLINK(A592),\".aspx\",\"\")&IF(C$1=2013,\"(v=ocs.15).aspx\",\"(v=ocs.14).aspx\"),A592)),\"\")","v":"Set-CsMcxConfiguration"},{"$f":"IF(ISTEXT(B592),(HYPERLINK(SUBSTITUTE(HLINK(B592),\".aspx\",\"\")&IF(D$1=2013,\"(v=ocs.15).aspx\",\"(v=ocs.14).aspx\"),B592)),\"\")","v":"Set-CsMcxConfiguration"},"Modifies an existing collection of Lync Server Mobility Service configuration settings. The Mobility Service enables users of mobile phones such as iPhones and Windows Phones to do such things as exchange instant messages and presence information; store and retrieve voice mail internally instead of with their wireless provider; and take advantage of Lync capabilities such as Call via Work and dial-out conferencing. This cmdlet was introduced in the cumulative update for Lync Server 2010: November 2011.","yes","no","no","no","no","no","yes","no","no","no","Get-CsAdminRole | ? {$_.Cmdlets –match \"Set-CsMcxConfiguration\"}"]
["Set-CsMediaConfiguration","Set-CsMediaConfiguration",{"$f":"IF(ISTEXT(A593),(HYPERLINK(SUBSTITUTE(HLINK(A593),\".aspx\",\"\")&IF(C$1=2013,\"(v=ocs.15).aspx\",\"(v=ocs.14).aspx\"),A593)),\"\")","v":"Set-CsMediaConfiguration"},{"$f":"IF(ISTEXT(B593),(HYPERLINK(SUBSTITUTE(HLINK(B593),\".aspx\",\"\")&IF(D$1=2013,\"(v=ocs.15).aspx\",\"(v=ocs.14).aspx\"),B593)),\"\")","v":"Set-CsMediaConfiguration"},"Modifies an existing collection of media settings.","yes","no","no","no","no","no","yes","no","no","yes",{"$f":"\"Get-CsAdminRole | ? {$_.Cmdlets –match \"& CHAR(34) &B593& CHAR(34) &\"}\"","v":"Get-CsAdminRole | ? {$_.Cmdlets –match \"Set-CsMediaConfiguration\"}"}]
["Set-CsMediationServer","Set-CsMediationServer",{"$f":"IF(ISTEXT(A594),(HYPERLINK(SUBSTITUTE(HLINK(A594),\".aspx\",\"\")&IF(C$1=2013,\"(v=ocs.15).aspx\",\"(v=ocs.14).aspx\"),A594)),\"\")","v":"Set-CsMediationServer"},{"$f":"IF(ISTEXT(B594),(HYPERLINK(SUBSTITUTE(HLINK(B594),\".aspx\",\"\")&IF(D$1=2013,\"(v=ocs.15).aspx\",\"(v=ocs.14).aspx\"),B594)),\"\")","v":"Set-CsMediationServer"},"Enables you to modify the properties of one or more Mediation Servers. Mediation Servers are used to route traffic between your internal Enterprise Voice infrastructure and a public switched telephone network (PSTN) gateway or a SIP trunk.","yes","no","no","no","no","no","yes","no","no","yes",{"$f":"\"Get-CsAdminRole | ? {$_.Cmdlets –match \"& CHAR(34) &B594& CHAR(34) &\"}\"","v":"Get-CsAdminRole | ? {$_.Cmdlets –match \"Set-CsMediationServer\"}"}]
["Set-CsMeetingConfiguration","Set-CsMeetingConfiguration",{"$f":"IF(ISTEXT(A595),(HYPERLINK(SUBSTITUTE(HLINK(A595),\".aspx\",\"\")&IF(C$1=2013,\"(v=ocs.15).aspx\",\"(v=ocs.14).aspx\"),A595)),\"\")","v":"Set-CsMeetingConfiguration"},{"$f":"IF(ISTEXT(B595),(HYPERLINK(SUBSTITUTE(HLINK(B595),\".aspx\",\"\")&IF(D$1=2013,\"(v=ocs.15).aspx\",\"(v=ocs.14).aspx\"),B595)),\"\")","v":"Set-CsMeetingConfiguration"},"Set-CsMeetingConfiguration enables you to modify the meeting configuration settings currently in use in your organization. Meeting configuration settings help dictate the type of meetings (also called conferences) that users can create, and also control how (or even if) anonymous users and dial-in conferencing users can join these meetings.","yes","no","no","no","no","no","yes","no","no","no",{"$f":"\"Get-CsAdminRole | ? {$_.Cmdlets –match \"& CHAR(34) &B595& CHAR(34) &\"}\"","v":"Get-CsAdminRole | ? {$_.Cmdlets –match \"Set-CsMeetingConfiguration\"}"}]
[null,"Set-CsMeetingRoom",{"$f":"IF(ISTEXT(A596),(HYPERLINK(SUBSTITUTE(HLINK(A596),\".aspx\",\"\")&IF(C$1=2013,\"(v=ocs.15).aspx\",\"(v=ocs.14).aspx\"),A596)),\"\")","v":""},{"$f":"IF(ISTEXT(B596),(HYPERLINK(SUBSTITUTE(HLINK(B596),\".aspx\",\"\")&IF(D$1=2013,\"(v=ocs.15).aspx\",\"(v=ocs.14).aspx\"),B596)),\"\")","v":"Set-CsMeetingRoom"},"Modifies the property values of an existing Lync Server 2013 meeting room. A meeting room is a conferencing device designed to address video conferencing and collaboration scenarios in small conference rooms. This cmdlet was introduced in Lync Server 2013.","yes","no","no","no","no","no","yes","no","no","no",{"$f":"\"Get-CsAdminRole | ? {$_.Cmdlets –match \"& CHAR(34) &B596& CHAR(34) &\"}\"","v":"Get-CsAdminRole | ? {$_.Cmdlets –match \"Set-CsMeetingRoom\"}"}]
["Set-CsMobilityPolicy","Set-CsMobilityPolicy",{"$f":"IF(ISTEXT(A597),(HYPERLINK(SUBSTITUTE(HLINK(A597),\".aspx\",\"\")&IF(C$1=2013,\"(v=ocs.15).aspx\",\"(v=ocs.14).aspx\"),A597)),\"\")","v":"Set-CsMobilityPolicy"},{"$f":"IF(ISTEXT(B597),(HYPERLINK(SUBSTITUTE(HLINK(B597),\".aspx\",\"\")&IF(D$1=2013,\"(v=ocs.15).aspx\",\"(v=ocs.14).aspx\"),B597)),\"\")","v":"Set-CsMobilityPolicy"},"Modifies an existing mobility policy. Mobility policies determine whether or not a user can use Lync Mobile. These policies also manage a user's ability to employ Call via Work, a feature that enables users to make and receive phone calls on their mobile phone by using their work phone number instead of their mobile phone number. Mobility policies can also be used to require Wi-Fi connections when making or receiving calls. This cmdlet was introduced in the cumulative update for Lync Server 2010: November 2011.","yes","no","no","no","no","no","yes","no","no","no",{"$f":"\"Get-CsAdminRole | ? {$_.Cmdlets –match \"& CHAR(34) &B597& CHAR(34) &\"}\"","v":"Get-CsAdminRole | ? {$_.Cmdlets –match \"Set-CsMobilityPolicy\"}"}]
["Set-CsMonitoringServer","Set-CsMonitoringServer",{"$f":"IF(ISTEXT(A598),(HYPERLINK(SUBSTITUTE(HLINK(A598),\".aspx\",\"\")&IF(C$1=2013,\"(v=ocs.15).aspx\",\"(v=ocs.14).aspx\"),A598)),\"\")","v":"Set-CsMonitoringServer"},{"$f":"IF(ISTEXT(B598),(HYPERLINK(SUBSTITUTE(HLINK(B598),\".aspx\",\"\")&IF(D$1=2013,\"(v=ocs.15).aspx\",\"(v=ocs.14).aspx\"),B598)),\"\")","v":"Set-CsMonitoringServer"},"Enables you to configure new locations for the Monitoring Server database and reporting pack.","yes","no","no","no","no","no","yes","no","no","no",{"$f":"\"Get-CsAdminRole | ? {$_.Cmdlets –match \"& CHAR(34) &B598& CHAR(34) &\"}\"","v":"Get-CsAdminRole | ? {$_.Cmdlets –match \"Set-CsMonitoringServer\"}"}]
["Set-CsNetworkBandwidthPolicyProfile","Set-CsNetworkBandwidthPolicyProfile",{"$f":"IF(ISTEXT(A599),(HYPERLINK(SUBSTITUTE(HLINK(A599),\".aspx\",\"\")&IF(C$1=2013,\"(v=ocs.15).aspx\",\"(v=ocs.14).aspx\"),A599)),\"\")","v":"Set-CsNetworkBandwidthPolicyProfile"},{"$f":"IF(ISTEXT(B599),(HYPERLINK(SUBSTITUTE(HLINK(B599),\".aspx\",\"\")&IF(D$1=2013,\"(v=ocs.15).aspx\",\"(v=ocs.14).aspx\"),B599)),\"\")","v":"Set-CsNetworkBandwidthPolicyProfile"},"Modifies an existing network bandwidth policy profile.","yes","no","no","no","no","no","yes","no","no","yes",{"$f":"\"Get-CsAdminRole | ? {$_.Cmdlets –match \"& CHAR(34) &B599& CHAR(34) &\"}\"","v":"Get-CsAdminRole | ? {$_.Cmdlets –match \"Set-CsNetworkBandwidthPolicyProfile\"}"}]
["Set-CsNetworkConfiguration","Set-CsNetworkConfiguration",{"$f":"IF(ISTEXT(A600),(HYPERLINK(SUBSTITUTE(HLINK(A600),\".aspx\",\"\")&IF(C$1=2013,\"(v=ocs.15).aspx\",\"(v=ocs.14).aspx\"),A600)),\"\")","v":"Set-CsNetworkConfiguration"},{"$f":"IF(ISTEXT(B600),(HYPERLINK(SUBSTITUTE(HLINK(B600),\".aspx\",\"\")&IF(D$1=2013,\"(v=ocs.15).aspx\",\"(v=ocs.14).aspx\"),B600)),\"\")","v":"Set-CsNetworkConfiguration"},"Modifies the settings for a network configuration. This cmdlet will most often be used to enable or disable call admission control (CAC).","yes","no","no","no","no","no","yes","no","no","yes",{"$f":"\"Get-CsAdminRole | ? {$_.Cmdlets –match \"& CHAR(34) &B600& CHAR(34) &\"}\"","v":"Get-CsAdminRole | ? {$_.Cmdlets –match \"Set-CsNetworkConfiguration\"}"}]
["Set-CsNetworkInterRegionRoute","Set-CsNetworkInterRegionRoute",{"$f":"IF(ISTEXT(A601),(HYPERLINK(SUBSTITUTE(HLINK(A601),\".aspx\",\"\")&IF(C$1=2013,\"(v=ocs.15).aspx\",\"(v=ocs.14).aspx\"),A601)),\"\")","v":"Set-CsNetworkInterRegionRoute"},{"$f":"IF(ISTEXT(B601),(HYPERLINK(SUBSTITUTE(HLINK(B601),\".aspx\",\"\")&IF(D$1=2013,\"(v=ocs.15).aspx\",\"(v=ocs.14).aspx\"),B601)),\"\")","v":"Set-CsNetworkInterRegionRoute"},"Modifies an existing route that connects network regions within a call admission control (CAC) configuration.","yes","no","no","no","no","no","yes","no","no","yes",{"$f":"\"Get-CsAdminRole | ? {$_.Cmdlets –match \"& CHAR(34) &B601& CHAR(34) &\"}\"","v":"Get-CsAdminRole | ? {$_.Cmdlets –match \"Set-CsNetworkInterRegionRoute\"}"}]
["Set-CsNetworkInterSitePolicy","Set-CsNetworkInterSitePolicy",{"$f":"IF(ISTEXT(A602),(HYPERLINK(SUBSTITUTE(HLINK(A602),\".aspx\",\"\")&IF(C$1=2013,\"(v=ocs.15).aspx\",\"(v=ocs.14).aspx\"),A602)),\"\")","v":"Set-CsNetworkInterSitePolicy"},{"$f":"IF(ISTEXT(B602),(HYPERLINK(SUBSTITUTE(HLINK(B602),\".aspx\",\"\")&IF(D$1=2013,\"(v=ocs.15).aspx\",\"(v=ocs.14).aspx\"),B602)),\"\")","v":"Set-CsNetworkInterSitePolicy"},"Modifies an existing network inter-site policy that defines bandwidth limitations between sites that are directly linked within a call admission control (CAC) configuration.","yes","no","no","no","no","no","yes","no","no","yes",{"$f":"\"Get-CsAdminRole | ? {$_.Cmdlets –match \"& CHAR(34) &B602& CHAR(34) &\"}\"","v":"Get-CsAdminRole | ? {$_.Cmdlets –match \"Set-CsNetworkInterSitePolicy\"}"}]
["Set-CsNetworkRegion","Set-CsNetworkRegion",{"$f":"IF(ISTEXT(A603),(HYPERLINK(SUBSTITUTE(HLINK(A603),\".aspx\",\"\")&IF(C$1=2013,\"(v=ocs.15).aspx\",\"(v=ocs.14).aspx\"),A603)),\"\")","v":"Set-CsNetworkRegion"},{"$f":"IF(ISTEXT(B603),(HYPERLINK(SUBSTITUTE(HLINK(B603),\".aspx\",\"\")&IF(D$1=2013,\"(v=ocs.15).aspx\",\"(v=ocs.14).aspx\"),B603)),\"\")","v":"Set-CsNetworkRegion"},"Modifies an existing network region. Network regions represent network hubs or backbones in an enterprise network.","yes","no","no","no","no","no","yes","no","no","yes",{"$f":"\"Get-CsAdminRole | ? {$_.Cmdlets –match \"& CHAR(34) &B603& CHAR(34) &\"}\"","v":"Get-CsAdminRole | ? {$_.Cmdlets –match \"Set-CsNetworkRegion\"}"}]
["Set-CsNetworkRegionLink","Set-CsNetworkRegionLink",{"$f":"IF(ISTEXT(A604),(HYPERLINK(SUBSTITUTE(HLINK(A604),\".aspx\",\"\")&IF(C$1=2013,\"(v=ocs.15).aspx\",\"(v=ocs.14).aspx\"),A604)),\"\")","v":"Set-CsNetworkRegionLink"},{"$f":"IF(ISTEXT(B604),(HYPERLINK(SUBSTITUTE(HLINK(B604),\".aspx\",\"\")&IF(D$1=2013,\"(v=ocs.15).aspx\",\"(v=ocs.14).aspx\"),B604)),\"\")","v":"Set-CsNetworkRegionLink"},"Modifies a link between two network regions configured for call admission control (CAC).","yes","no","no","no","no","no","yes","no","no","yes",{"$f":"\"Get-CsAdminRole | ? {$_.Cmdlets –match \"& CHAR(34) &B604& CHAR(34) &\"}\"","v":"Get-CsAdminRole | ? {$_.Cmdlets –match \"Set-CsNetworkRegionLink\"}"}]
["Set-CsNetworkSite","Set-CsNetworkSite",{"$f":"IF(ISTEXT(A605),(HYPERLINK(SUBSTITUTE(HLINK(A605),\".aspx\",\"\")&IF(C$1=2013,\"(v=ocs.15).aspx\",\"(v=ocs.14).aspx\"),A605)),\"\")","v":"Set-CsNetworkSite"},{"$f":"IF(ISTEXT(B605),(HYPERLINK(SUBSTITUTE(HLINK(B605),\".aspx\",\"\")&IF(D$1=2013,\"(v=ocs.15).aspx\",\"(v=ocs.14).aspx\"),B605)),\"\")","v":"Set-CsNetworkSite"},"Modifies an existing network site that has been defined for call admission control (CAC) or Enhanced 9-1-1 (E9-1-1).","yes","no","no","yes","no","no","yes","no","no","yes",{"$f":"\"Get-CsAdminRole | ? {$_.Cmdlets –match \"& CHAR(34) &B605& CHAR(34) &\"}\"","v":"Get-CsAdminRole | ? {$_.Cmdlets –match \"Set-CsNetworkSite\"}"}]
["Set-CsNetworkSubnet","Set-CsNetworkSubnet",{"$f":"IF(ISTEXT(A606),(HYPERLINK(SUBSTITUTE(HLINK(A606),\".aspx\",\"\")&IF(C$1=2013,\"(v=ocs.15).aspx\",\"(v=ocs.14).aspx\"),A606)),\"\")","v":"Set-CsNetworkSubnet"},{"$f":"IF(ISTEXT(B606),(HYPERLINK(SUBSTITUTE(HLINK(B606),\".aspx\",\"\")&IF(D$1=2013,\"(v=ocs.15).aspx\",\"(v=ocs.14).aspx\"),B606)),\"\")","v":"Set-CsNetworkSubnet"},"Modifies an existing network subnet.","yes","no","no","yes","no","no","yes","no","no","yes",{"$f":"\"Get-CsAdminRole | ? {$_.Cmdlets –match \"& CHAR(34) &B606& CHAR(34) &\"}\"","v":"Get-CsAdminRole | ? {$_.Cmdlets –match \"Set-CsNetworkSubnet\"}"}]
[null,"Set-CsOAuthConfiguration",{"$f":"IF(ISTEXT(A607),(HYPERLINK(SUBSTITUTE(HLINK(A607),\".aspx\",\"\")&IF(C$1=2013,\"(v=ocs.15).aspx\",\"(v=ocs.14).aspx\"),A607)),\"\")","v":""},{"$f":"IF(ISTEXT(B607),(HYPERLINK(SUBSTITUTE(HLINK(B607),\".aspx\",\"\")&IF(D$1=2013,\"(v=ocs.15).aspx\",\"(v=ocs.14).aspx\"),B607)),\"\")","v":"Set-CsOAuthConfiguration"},"Modifies the Open Authorization (OAuth) configuration settings currently in use in the organization. OAuth is a standard protocol used for server-to-server authentication and authorization. This cmdlet was introduced in Lync Server 2013.","yes","no","no","no","no","no","yes","no","no","no",{"$f":"\"Get-CsAdminRole | ? {$_.Cmdlets –match \"& CHAR(34) &B607& CHAR(34) &\"}\"","v":"Get-CsAdminRole | ? {$_.Cmdlets –match \"Set-CsOAuthConfiguration\"}"}]
[null,"Set-CsOAuthServer",{"$f":"IF(ISTEXT(A608),(HYPERLINK(SUBSTITUTE(HLINK(A608),\".aspx\",\"\")&IF(C$1=2013,\"(v=ocs.15).aspx\",\"(v=ocs.14).aspx\"),A608)),\"\")","v":""},{"$f":"IF(ISTEXT(B608),(HYPERLINK(SUBSTITUTE(HLINK(B608),\".aspx\",\"\")&IF(D$1=2013,\"(v=ocs.15).aspx\",\"(v=ocs.14).aspx\"),B608)),\"\")","v":"Set-CsOAuthServer"},"Modifies an existing Open Authorization (OAuth) server. OAuth servers, also known as security token servers, issue security tokens used in server-to-server authentication and authorization. This cmdlet was introduced in Lync Server 2013.","yes","no","no","no","no","no","yes","no","no","no",{"$f":"\"Get-CsAdminRole | ? {$_.Cmdlets –match \"& CHAR(34) &B608& CHAR(34) &\"}\"","v":"Get-CsAdminRole | ? {$_.Cmdlets –match \"Set-CsOAuthServer\"}"}]
[null,"Set-CsOutboundCallingNumberTranslationRule",{"$f":"IF(ISTEXT(A609),(HYPERLINK(SUBSTITUTE(HLINK(A609),\".aspx\",\"\")&IF(C$1=2013,\"(v=ocs.15).aspx\",\"(v=ocs.14).aspx\"),A609)),\"\")","v":""},{"$f":"IF(ISTEXT(B609),(HYPERLINK(SUBSTITUTE(HLINK(B609),\".aspx\",\"\")&IF(D$1=2013,\"(v=ocs.15).aspx\",\"(v=ocs.14).aspx\"),B609)),\"\")","v":"Set-CsOutboundCallingNumberTranslationRule"},"Modifies an existing outbound calling number translation rule. An outbound calling number translation rule converts the E.164 phone numbers used by Lync Server 2013 to a format that can be used by trunking peers that do not support E.164 numbers. This cmdlet was introduced in Lync Server 2013.","yes","no","no","no","no","no","yes","no","no","yes",{"$f":"\"Get-CsAdminRole | ? {$_.Cmdlets –match \"& CHAR(34) &B609& CHAR(34) &\"}\"","v":"Get-CsAdminRole | ? {$_.Cmdlets –match \"Set-CsOutboundCallingNumberTranslationRule\"}"}]
["Set-CsOutboundTranslationRule","Set-CsOutboundTranslationRule",{"$f":"IF(ISTEXT(A610),(HYPERLINK(SUBSTITUTE(HLINK(A610),\".aspx\",\"\")&IF(C$1=2013,\"(v=ocs.15).aspx\",\"(v=ocs.14).aspx\"),A610)),\"\")","v":"Set-CsOutboundTranslationRule"},{"$f":"IF(ISTEXT(B610),(HYPERLINK(SUBSTITUTE(HLINK(B610),\".aspx\",\"\")&IF(D$1=2013,\"(v=ocs.15).aspx\",\"(v=ocs.14).aspx\"),B610)),\"\")","v":"Set-CsOutboundTranslationRule"},"Modifies an existing outbound translation rule. An outbound translation rule converts phone numbers to the local dialing format for interaction with private branch exchange (PBX) systems.","yes","no","no","no","no","no","yes","no","no","yes",{"$f":"\"Get-CsAdminRole | ? {$_.Cmdlets –match \"& CHAR(34) &B610& CHAR(34) &\"}\"","v":"Get-CsAdminRole | ? {$_.Cmdlets –match \"Set-CsOutboundTranslationRule\"}"}]
[null,"Set-CsPartnerApplication",{"$f":"IF(ISTEXT(A611),(HYPERLINK(SUBSTITUTE(HLINK(A611),\".aspx\",\"\")&IF(C$1=2013,\"(v=ocs.15).aspx\",\"(v=ocs.14).aspx\"),A611)),\"\")","v":""},{"$f":"IF(ISTEXT(B611),(HYPERLINK(SUBSTITUTE(HLINK(B611),\".aspx\",\"\")&IF(D$1=2013,\"(v=ocs.15).aspx\",\"(v=ocs.14).aspx\"),B611)),\"\")","v":"Set-CsPartnerApplication"},"Modifies an existing partner application. A partner application is any application that Lync Online can directly exchange security tokens with, without having to go through a third-party security token server. This cmdlet was introduced in Lync Server 2013.","yes","no","no","no","no","no","yes","no","no","no",{"$f":"\"Get-CsAdminRole | ? {$_.Cmdlets –match \"& CHAR(34) &B611& CHAR(34) &\"}\"","v":"Get-CsAdminRole | ? {$_.Cmdlets –match \"Set-CsPartnerApplication\"}"}]
[null,"Set-CsPersistentChatActiveServer",{"$f":"IF(ISTEXT(A612),(HYPERLINK(SUBSTITUTE(HLINK(A612),\".aspx\",\"\")&IF(C$1=2013,\"(v=ocs.15).aspx\",\"(v=ocs.14).aspx\"),A612)),\"\")","v":""},{"$f":"IF(ISTEXT(B612),(HYPERLINK(SUBSTITUTE(HLINK(B612),\".aspx\",\"\")&IF(D$1=2013,\"(v=ocs.15).aspx\",\"(v=ocs.14).aspx\"),B612)),\"\")","v":"Set-CsPersistentChatActiveServer"},"Manages the list of active Persistent Chat servers. An active server is Persistent Chat server (in a specified Persistent Chat service pool) that is fully operational and can accept new client connections. Servers in the pool that have not been marked as active servers might be operational, but are currently unable to accept new client connections. This cmdlet was introduced in Lync Server 2013.","yes","no","no","no","yes","no","yes","no","no","no",{"$f":"\"Get-CsAdminRole | ? {$_.Cmdlets –match \"& CHAR(34) &B612& CHAR(34) &\"}\"","v":"Get-CsAdminRole | ? {$_.Cmdlets –match \"Set-CsPersistentChatActiveServer\"}"}]
[null,"Set-CsPersistentChatAddin",{"$f":"IF(ISTEXT(A613),(HYPERLINK(SUBSTITUTE(HLINK(A613),\".aspx\",\"\")&IF(C$1=2013,\"(v=ocs.15).aspx\",\"(v=ocs.14).aspx\"),A613)),\"\")","v":""},{"$f":"IF(ISTEXT(B613),(HYPERLINK(SUBSTITUTE(HLINK(B613),\".aspx\",\"\")&IF(D$1=2013,\"(v=ocs.15).aspx\",\"(v=ocs.14).aspx\"),B613)),\"\")","v":"Set-CsPersistentChatAddin"},"Modifies an existing Persistent Chat add-in. A Persistent Chat add-in is a customized web page that can be embedded within a Persistent Chat client. This cmdlet was introduced in Lync Server 2013.","yes","no","no","no","yes","no","yes","no","no","no",{"$f":"\"Get-CsAdminRole | ? {$_.Cmdlets –match \"& CHAR(34) &B613& CHAR(34) &\"}\"","v":"Get-CsAdminRole | ? {$_.Cmdlets –match \"Set-CsPersistentChatAddin\"}"}]
[null,"Set-CsPersistentChatCategory",{"$f":"IF(ISTEXT(A614),(HYPERLINK(SUBSTITUTE(HLINK(A614),\".aspx\",\"\")&IF(C$1=2013,\"(v=ocs.15).aspx\",\"(v=ocs.14).aspx\"),A614)),\"\")","v":""},{"$f":"IF(ISTEXT(B614),(HYPERLINK(SUBSTITUTE(HLINK(B614),\".aspx\",\"\")&IF(D$1=2013,\"(v=ocs.15).aspx\",\"(v=ocs.14).aspx\"),B614)),\"\")","v":"Set-CsPersistentChatCategory"},"Modifies an existing Persistent Chat category. A Persistent Chat category represents a collection of Persistent Chat chat rooms. Each chat room must be associated with a category. This cmdlet was introduced in Lync Server 2013.","yes","no","no","no","yes","no","yes","no","no","no",{"$f":"\"Get-CsAdminRole | ? {$_.Cmdlets –match \"& CHAR(34) &B614& CHAR(34) &\"}\"","v":"Get-CsAdminRole | ? {$_.Cmdlets –match \"Set-CsPersistentChatCategory\"}"}]
[null,"Set-CsPersistentChatComplianceConfiguration",{"$f":"IF(ISTEXT(A615),(HYPERLINK(SUBSTITUTE(HLINK(A615),\".aspx\",\"\")&IF(C$1=2013,\"(v=ocs.15).aspx\",\"(v=ocs.14).aspx\"),A615)),\"\")","v":""},{"$f":"IF(ISTEXT(B615),(HYPERLINK(SUBSTITUTE(HLINK(B615),\".aspx\",\"\")&IF(D$1=2013,\"(v=ocs.15).aspx\",\"(v=ocs.14).aspx\"),B615)),\"\")","v":"Set-CsPersistentChatComplianceConfiguration"},"Modifies an existing collection of Persistent Chat compliance configuration settings. Persistent Chat compliance enables administrators to maintain an archive of Persistent Chat items and activities including: new messages; new events (for example, a user entering or existing a chat room); file uploads and downloads; and searches run against the chat history. This cmdlet was introduced in Lync Server 2013.","yes","yes","no","no","yes","no","yes","no","no","no",{"$f":"\"Get-CsAdminRole | ? {$_.Cmdlets –match \"& CHAR(34) &B615& CHAR(34) &\"}\"","v":"Get-CsAdminRole | ? {$_.Cmdlets –match \"Set-CsPersistentChatComplianceConfiguration\"}"}]
[null,"Set-CsPersistentChatConfiguration",{"$f":"IF(ISTEXT(A616),(HYPERLINK(SUBSTITUTE(HLINK(A616),\".aspx\",\"\")&IF(C$1=2013,\"(v=ocs.15).aspx\",\"(v=ocs.14).aspx\"),A616)),\"\")","v":""},{"$f":"IF(ISTEXT(B616),(HYPERLINK(SUBSTITUTE(HLINK(B616),\".aspx\",\"\")&IF(D$1=2013,\"(v=ocs.15).aspx\",\"(v=ocs.14).aspx\"),B616)),\"\")","v":"Set-CsPersistentChatConfiguration"},"Modifies an existing collection of Persistent Chat configuration settings. Persistent Chat configuration settings are used to manage the Persistent Chat service. For example, these settings allow you to specify the maximum number of users who can participate in a chat room. This cmdlet was introduced in Lync Server 2013.","yes","no","no","no","yes","no","yes","no","no","no",{"$f":"\"Get-CsAdminRole | ? {$_.Cmdlets –match \"& CHAR(34) &B616& CHAR(34) &\"}\"","v":"Get-CsAdminRole | ? {$_.Cmdlets –match \"Set-CsPersistentChatConfiguration\"}"}]
[null,"Set-CsPersistentChatPolicy",{"$f":"IF(ISTEXT(A617),(HYPERLINK(SUBSTITUTE(HLINK(A617),\".aspx\",\"\")&IF(C$1=2013,\"(v=ocs.15).aspx\",\"(v=ocs.14).aspx\"),A617)),\"\")","v":""},{"$f":"IF(ISTEXT(B617),(HYPERLINK(SUBSTITUTE(HLINK(B617),\".aspx\",\"\")&IF(D$1=2013,\"(v=ocs.15).aspx\",\"(v=ocs.14).aspx\"),B617)),\"\")","v":"Set-CsPersistentChatPolicy"},"Modifies an existing Persistent Chat policy. Persistent Chat policies determine whether or not users are allowed access to Persistent Chat chat rooms. This cmdlet was introduced in Lync Server 2013.","yes","no","no","no","yes","no","yes","no","no","no",{"$f":"\"Get-CsAdminRole | ? {$_.Cmdlets –match \"& CHAR(34) &B617& CHAR(34) &\"}\"","v":"Get-CsAdminRole | ? {$_.Cmdlets –match \"Set-CsPersistentChatPolicy\"}"}]
[null,"Set-CsPersistentChatRoom",{"$f":"IF(ISTEXT(A618),(HYPERLINK(SUBSTITUTE(HLINK(A618),\".aspx\",\"\")&IF(C$1=2013,\"(v=ocs.15).aspx\",\"(v=ocs.14).aspx\"),A618)),\"\")","v":""},{"$f":"IF(ISTEXT(B618),(HYPERLINK(SUBSTITUTE(HLINK(B618),\".aspx\",\"\")&IF(D$1=2013,\"(v=ocs.15).aspx\",\"(v=ocs.14).aspx\"),B618)),\"\")","v":"Set-CsPersistentChatRoom"},"Modifies and existing Persistent Chat chat room. A chat room is a discussion forum that typically revolves around a specific topic. This cmdlet was introduced in Lync Server 2013.","yes","no","no","no","yes","no","yes","no","no","no",{"$f":"\"Get-CsAdminRole | ? {$_.Cmdlets –match \"& CHAR(34) &B618& CHAR(34) &\"}\"","v":"Get-CsAdminRole | ? {$_.Cmdlets –match \"Set-CsPersistentChatRoom\"}"}]
[null,"Set-CsPersistentChatState",{"$f":"IF(ISTEXT(A619),(HYPERLINK(SUBSTITUTE(HLINK(A619),\".aspx\",\"\")&IF(C$1=2013,\"(v=ocs.15).aspx\",\"(v=ocs.14).aspx\"),A619)),\"\")","v":""},{"$f":"IF(ISTEXT(B619),(HYPERLINK(SUBSTITUTE(HLINK(B619),\".aspx\",\"\")&IF(D$1=2013,\"(v=ocs.15).aspx\",\"(v=ocs.14).aspx\"),B619)),\"\")","v":"Set-CsPersistentChatState"},"Modifies the state of a Persistent Chat service pool. Persistent Chat pools can be in one of two states: Normal, in which the pool uses its primary databases; or FailedOver, in which the pool uses the backup databases defined in the topology. This cmdlet was introduced in Lync Server 2013.","yes","no","no","no","yes","no","yes","no","no","no",{"$f":"\"Get-CsAdminRole | ? {$_.Cmdlets –match \"& CHAR(34) &B619& CHAR(34) &\"}\"","v":"Get-CsAdminRole | ? {$_.Cmdlets –match \"Set-CsPersistentChatState\"}"}]
["Set-CsPinPolicy","Set-CsPinPolicy",{"$f":"IF(ISTEXT(A620),(HYPERLINK(SUBSTITUTE(HLINK(A620),\".aspx\",\"\")&IF(C$1=2013,\"(v=ocs.15).aspx\",\"(v=ocs.14).aspx\"),A620)),\"\")","v":"Set-CsPinPolicy"},{"$f":"IF(ISTEXT(B620),(HYPERLINK(SUBSTITUTE(HLINK(B620),\".aspx\",\"\")&IF(D$1=2013,\"(v=ocs.15).aspx\",\"(v=ocs.14).aspx\"),B620)),\"\")","v":"Set-CsPinPolicy"},"Modifies one or more existing client personal identification number (PIN) policies. PIN authentication enables users to access Microsoft Lync Server 2010 by providing a PIN instead of a user name and password.","yes","no","no","no","no","no","yes","no","no","no",{"$f":"\"Get-CsAdminRole | ? {$_.Cmdlets –match \"& CHAR(34) &B620& CHAR(34) &\"}\"","v":"Get-CsAdminRole | ? {$_.Cmdlets –match \"Set-CsPinPolicy\"}"}]
["Set-CsPresencePolicy","Set-CsPresencePolicy",{"$f":"IF(ISTEXT(A621),(HYPERLINK(SUBSTITUTE(HLINK(A621),\".aspx\",\"\")&IF(C$1=2013,\"(v=ocs.15).aspx\",\"(v=ocs.14).aspx\"),A621)),\"\")","v":"Set-CsPresencePolicy"},{"$f":"IF(ISTEXT(B621),(HYPERLINK(SUBSTITUTE(HLINK(B621),\".aspx\",\"\")&IF(D$1=2013,\"(v=ocs.15).aspx\",\"(v=ocs.14).aspx\"),B621)),\"\")","v":"Set-CsPresencePolicy"},"Modifies an existing presence policy.","yes","no","no","no","no","no","yes","no","no","no",{"$f":"\"Get-CsAdminRole | ? {$_.Cmdlets –match \"& CHAR(34) &B621& CHAR(34) &\"}\"","v":"Get-CsAdminRole | ? {$_.Cmdlets –match \"Set-CsPresencePolicy\"}"}]
[null,"Set-CsPresenceProvider",{"$f":"IF(ISTEXT(A622),(HYPERLINK(SUBSTITUTE(HLINK(A622),\".aspx\",\"\")&IF(C$1=2013,\"(v=ocs.15).aspx\",\"(v=ocs.14).aspx\"),A622)),\"\")","v":""},{"$f":"IF(ISTEXT(B622),(HYPERLINK(SUBSTITUTE(HLINK(B622),\".aspx\",\"\")&IF(D$1=2013,\"(v=ocs.15).aspx\",\"(v=ocs.14).aspx\"),B622)),\"\")","v":"Set-CsPresenceProvider"},"Modifies a presence provider configured for use in the organization. Presence providers represent the PresenceProviders property of a collection of user services configuration settings. This cmdlet was introduced in Lync Server 2013.","yes","no","no","no","no","no","yes","no","no","no",{"$f":"\"Get-CsAdminRole | ? {$_.Cmdlets –match \"& CHAR(34) &B622& CHAR(34) &\"}\"","v":"Get-CsAdminRole | ? {$_.Cmdlets –match \"Set-CsPresenceProvider\"}"}]
["Set-CsPrivacyConfiguration","Set-CsPrivacyConfiguration",{"$f":"IF(ISTEXT(A623),(HYPERLINK(SUBSTITUTE(HLINK(A623),\".aspx\",\"\")&IF(C$1=2013,\"(v=ocs.15).aspx\",\"(v=ocs.14).aspx\"),A623)),\"\")","v":"Set-CsPrivacyConfiguration"},{"$f":"IF(ISTEXT(B623),(HYPERLINK(SUBSTITUTE(HLINK(B623),\".aspx\",\"\")&IF(D$1=2013,\"(v=ocs.15).aspx\",\"(v=ocs.14).aspx\"),B623)),\"\")","v":"Set-CsPrivacyConfiguration"},"Modifies an existing set of privacy configuration settings. Privacy configuration settings help determine how much information users make available to other users.","yes","no","no","no","no","no","yes","no","no","no",{"$f":"\"Get-CsAdminRole | ? {$_.Cmdlets –match \"& CHAR(34) &B623& CHAR(34) &\"}\"","v":"Get-CsAdminRole | ? {$_.Cmdlets –match \"Set-CsPrivacyConfiguration\"}"}]
["Set-CsProxyConfiguration","Set-CsProxyConfiguration",{"$f":"IF(ISTEXT(A624),(HYPERLINK(SUBSTITUTE(HLINK(A624),\".aspx\",\"\")&IF(C$1=2013,\"(v=ocs.15).aspx\",\"(v=ocs.14).aspx\"),A624)),\"\")","v":"Set-CsProxyConfiguration"},{"$f":"IF(ISTEXT(B624),(HYPERLINK(SUBSTITUTE(HLINK(B624),\".aspx\",\"\")&IF(D$1=2013,\"(v=ocs.15).aspx\",\"(v=ocs.14).aspx\"),B624)),\"\")","v":"Set-CsProxyConfiguration"},"Modifies an existing collection of proxy server configuration settings.","yes","no","no","no","no","no","yes","no","no","no",{"$f":"\"Get-CsAdminRole | ? {$_.Cmdlets –match \"& CHAR(34) &B624& CHAR(34) &\"}\"","v":"Get-CsAdminRole | ? {$_.Cmdlets –match \"Set-CsProxyConfiguration\"}"}]
["Set-CsPstnGateway","Set-CsPstnGateway",{"$f":"IF(ISTEXT(A625),(HYPERLINK(SUBSTITUTE(HLINK(A625),\".aspx\",\"\")&IF(C$1=2013,\"(v=ocs.15).aspx\",\"(v=ocs.14).aspx\"),A625)),\"\")","v":"Set-CsPstnGateway"},{"$f":"IF(ISTEXT(B625),(HYPERLINK(SUBSTITUTE(HLINK(B625),\".aspx\",\"\")&IF(D$1=2013,\"(v=ocs.15).aspx\",\"(v=ocs.14).aspx\"),B625)),\"\")","v":"Set-CsPstnGateway"},"Modifies the properties of a public switched telephone network (PSTN) gateway. PSTN gateways help route calls between devices on the external PSTN network and devices on your internal Enterprise Voice network.","yes","no","no","no","no","no","yes","no","no","yes",{"$f":"\"Get-CsAdminRole | ? {$_.Cmdlets –match \"& CHAR(34) &B625& CHAR(34) &\"}\"","v":"Get-CsAdminRole | ? {$_.Cmdlets –match \"Set-CsPstnGateway\"}"}]
["Set-CsPstnUsage","Set-CsPstnUsage",{"$f":"IF(ISTEXT(A626),(HYPERLINK(SUBSTITUTE(HLINK(A626),\".aspx\",\"\")&IF(C$1=2013,\"(v=ocs.15).aspx\",\"(v=ocs.14).aspx\"),A626)),\"\")","v":"Set-CsPstnUsage"},{"$f":"IF(ISTEXT(B626),(HYPERLINK(SUBSTITUTE(HLINK(B626),\".aspx\",\"\")&IF(D$1=2013,\"(v=ocs.15).aspx\",\"(v=ocs.14).aspx\"),B626)),\"\")","v":"Set-CsPstnUsage"},"Modifies a set of strings that identify the allowed public switched telephone network (PSTN) usages. This cmdlet can be used to add usages to the list of PSTN usages or remove usages from the list.","yes","no","no","no","no","no","yes","no","no","yes",{"$f":"\"Get-CsAdminRole | ? {$_.Cmdlets –match \"& CHAR(34) &B626& CHAR(34) &\"}\"","v":"Get-CsAdminRole | ? {$_.Cmdlets –match \"Set-CsPstnUsage\"}"}]
["Set-CsPublicProvider","Set-CsPublicProvider",{"$f":"IF(ISTEXT(A627),(HYPERLINK(SUBSTITUTE(HLINK(A627),\".aspx\",\"\")&IF(C$1=2013,\"(v=ocs.15).aspx\",\"(v=ocs.14).aspx\"),A627)),\"\")","v":"Set-CsPublicProvider"},{"$f":"IF(ISTEXT(B627),(HYPERLINK(SUBSTITUTE(HLINK(B627),\".aspx\",\"\")&IF(D$1=2013,\"(v=ocs.15).aspx\",\"(v=ocs.14).aspx\"),B627)),\"\")","v":"Set-CsPublicProvider"},"Modifies a public provider currently configured for use in your organization. A public provider is an organization that provides instant messaging (IM), presence, and related services to the general public. Microsoft Lync Server 2010 ships with three public providers configured but not enabled: Yahoo!; AOL; and MSN.","yes","no","no","no","no","no","yes","no","no","no",{"$f":"\"Get-CsAdminRole | ? {$_.Cmdlets –match \"& CHAR(34) &B627& CHAR(34) &\"}\"","v":"Get-CsAdminRole | ? {$_.Cmdlets –match \"Set-CsPublicProvider\"}"}]
["Set-CsPushNotificationConfiguration","Set-CsPushNotificationConfiguration",{"$f":"IF(ISTEXT(A628),(HYPERLINK(SUBSTITUTE(HLINK(A628),\".aspx\",\"\")&IF(C$1=2013,\"(v=ocs.15).aspx\",\"(v=ocs.14).aspx\"),A628)),\"\")","v":"Set-CsPushNotificationConfiguration"},{"$f":"IF(ISTEXT(B628),(HYPERLINK(SUBSTITUTE(HLINK(B628),\".aspx\",\"\")&IF(D$1=2013,\"(v=ocs.15).aspx\",\"(v=ocs.14).aspx\"),B628)),\"\")","v":"Set-CsPushNotificationConfiguration"},"Modifies an existing collection of push notification configuration settings. The push notification service (Apple Push Notification Service and Microsoft Push Notification Service) provides a way to send notifications about events such as new instant messages or new voice mail to mobile devices such as iPhones and Windows Phones, even if the Lync application on those devices is currently suspended or running in the background. This cmdlet was introduced in the cumulative update for Lync Server 2010: November 2011.","yes","no","no","no","no","no","yes","no","no","no",{"$f":"\"Get-CsAdminRole | ? {$_.Cmdlets –match \"& CHAR(34) &B628& CHAR(34) &\"}\"","v":"Get-CsAdminRole | ? {$_.Cmdlets –match \"Set-CsPushNotificationConfiguration\"}"}]
["Set-CsQoEConfiguration","Set-CsQoEConfiguration",{"$f":"IF(ISTEXT(A629),(HYPERLINK(SUBSTITUTE(HLINK(A629),\".aspx\",\"\")&IF(C$1=2013,\"(v=ocs.15).aspx\",\"(v=ocs.14).aspx\"),A629)),\"\")","v":"Set-CsQoEConfiguration"},{"$f":"IF(ISTEXT(B629),(HYPERLINK(SUBSTITUTE(HLINK(B629),\".aspx\",\"\")&IF(D$1=2013,\"(v=ocs.15).aspx\",\"(v=ocs.14).aspx\"),B629)),\"\")","v":"Set-CsQoEConfiguration"},"Modifies an existing collection of QoE (Quality of Experience) settings.","yes","no","no","no","no","no","yes","no","no","yes",{"$f":"\"Get-CsAdminRole | ? {$_.Cmdlets –match \"& CHAR(34) &B629& CHAR(34) &\"}\"","v":"Get-CsAdminRole | ? {$_.Cmdlets –match \"Set-CsQoEConfiguration\"}"}]
["Set-CsRegistrar","Set-CsRegistrar",{"$f":"IF(ISTEXT(A630),(HYPERLINK(SUBSTITUTE(HLINK(A630),\".aspx\",\"\")&IF(C$1=2013,\"(v=ocs.15).aspx\",\"(v=ocs.14).aspx\"),A630)),\"\")","v":"Set-CsRegistrar"},{"$f":"IF(ISTEXT(B630),(HYPERLINK(SUBSTITUTE(HLINK(B630),\".aspx\",\"\")&IF(D$1=2013,\"(v=ocs.15).aspx\",\"(v=ocs.14).aspx\"),B630)),\"\")","v":"Set-CsRegistrar"},"Enables you to modify the properties of one or more Registrars. Registrars are used to authenticate logon requests, and to maintain information about user status and availability.","yes","no","no","no","no","no","yes","no","no","no",{"$f":"\"Get-CsAdminRole | ? {$_.Cmdlets –match \"& CHAR(34) &B630& CHAR(34) &\"}\"","v":"Get-CsAdminRole | ? {$_.Cmdlets –match \"Set-CsRegistrar\"}"}]
["Set-CsRegistrarConfiguration","Set-CsRegistrarConfiguration",{"$f":"IF(ISTEXT(A631),(HYPERLINK(SUBSTITUTE(HLINK(A631),\".aspx\",\"\")&IF(C$1=2013,\"(v=ocs.15).aspx\",\"(v=ocs.14).aspx\"),A631)),\"\")","v":"Set-CsRegistrarConfiguration"},{"$f":"IF(ISTEXT(B631),(HYPERLINK(SUBSTITUTE(HLINK(B631),\".aspx\",\"\")&IF(D$1=2013,\"(v=ocs.15).aspx\",\"(v=ocs.14).aspx\"),B631)),\"\")","v":"Set-CsRegistrarConfiguration"},"Modifies the property values in an existing collection of Registrar configuration settings. Registrars are used to authenticate logon requests and to maintain information about user status and availability.","yes","no","no","no","no","no","yes","no","no","no",{"$f":"\"Get-CsAdminRole | ? {$_.Cmdlets –match \"& CHAR(34) &B631& CHAR(34) &\"}\"","v":"Get-CsAdminRole | ? {$_.Cmdlets –match \"Set-CsRegistrarConfiguration\"}"}]
[null,"Set-CsReportingConfiguration",{"$f":"IF(ISTEXT(A632),(HYPERLINK(SUBSTITUTE(HLINK(A632),\".aspx\",\"\")&IF(C$1=2013,\"(v=ocs.15).aspx\",\"(v=ocs.14).aspx\"),A632)),\"\")","v":""},{"$f":"IF(ISTEXT(B632),(HYPERLINK(SUBSTITUTE(HLINK(B632),\".aspx\",\"\")&IF(D$1=2013,\"(v=ocs.15).aspx\",\"(v=ocs.14).aspx\"),B632)),\"\")","v":"Set-CsReportingConfiguration"},"Modifies the reporting URL for an existing collection of reporting configuration settings. Reporting configuration settings are used to specify the URL used to access Lync Server 2013 Monitoring Reports. This cmdlet was introduced in Lync Server 2013.","yes","no","no","no","no","no","yes","no","no","no",{"$f":"\"Get-CsAdminRole | ? {$_.Cmdlets –match \"& CHAR(34) &B632& CHAR(34) &\"}\"","v":"Get-CsAdminRole | ? {$_.Cmdlets –match \"Set-CsReportingConfiguration\"}"}]
["Set-CsRgsAgentGroup","Set-CsRgsAgentGroup",{"$f":"IF(ISTEXT(A633),(HYPERLINK(SUBSTITUTE(HLINK(A633),\".aspx\",\"\")&IF(C$1=2013,\"(v=ocs.15).aspx\",\"(v=ocs.14).aspx\"),A633)),\"\")","v":"Set-CsRgsAgentGroup"},{"$f":"IF(ISTEXT(B633),(HYPERLINK(SUBSTITUTE(HLINK(B633),\".aspx\",\"\")&IF(D$1=2013,\"(v=ocs.15).aspx\",\"(v=ocs.14).aspx\"),B633)),\"\")","v":"Set-CsRgsAgentGroup"},"Modifies an existing Response Group agent group. An agent group is a collection of agents assigned to a Response Group queue. Agents are the users assigned to answer calls directed to a particular queue.","yes","no","no","no","no","yes","yes","no","no","yes",{"$f":"\"Get-CsAdminRole | ? {$_.Cmdlets –match \"& CHAR(34) &B633& CHAR(34) &\"}\"","v":"Get-CsAdminRole | ? {$_.Cmdlets –match \"Set-CsRgsAgentGroup\"}"}]
["Set-CsRgsConfiguration","Set-CsRgsConfiguration",{"$f":"IF(ISTEXT(A634),(HYPERLINK(SUBSTITUTE(HLINK(A634),\".aspx\",\"\")&IF(C$1=2013,\"(v=ocs.15).aspx\",\"(v=ocs.14).aspx\"),A634)),\"\")","v":"Set-CsRgsConfiguration"},{"$f":"IF(ISTEXT(B634),(HYPERLINK(SUBSTITUTE(HLINK(B634),\".aspx\",\"\")&IF(D$1=2013,\"(v=ocs.15).aspx\",\"(v=ocs.14).aspx\"),B634)),\"\")","v":"Set-CsRgsConfiguration"},"Modifies configuration settings for the Response Group application.","yes","no","no","no","no","yes","yes","no","no","yes",{"$f":"\"Get-CsAdminRole | ? {$_.Cmdlets –match \"& CHAR(34) &B634& CHAR(34) &\"}\"","v":"Get-CsAdminRole | ? {$_.Cmdlets –match \"Set-CsRgsConfiguration\"}"}]
["Set-CsRgsHolidaySet","Set-CsRgsHolidaySet",{"$f":"IF(ISTEXT(A635),(HYPERLINK(SUBSTITUTE(HLINK(A635),\".aspx\",\"\")&IF(C$1=2013,\"(v=ocs.15).aspx\",\"(v=ocs.14).aspx\"),A635)),\"\")","v":"Set-CsRgsHolidaySet"},{"$f":"IF(ISTEXT(B635),(HYPERLINK(SUBSTITUTE(HLINK(B635),\".aspx\",\"\")&IF(D$1=2013,\"(v=ocs.15).aspx\",\"(v=ocs.14).aspx\"),B635)),\"\")","v":"Set-CsRgsHolidaySet"},"Modifies the property values of an existing Response Group holiday set. A Response Group holiday set is a collection of holidays. For example, you might have one holiday set for a United States (U.S.)-based queue (a set that might include a holiday for the Fourth of July) and a different set for a queue based in France. The latter queue might define a holiday for Bastille Day but not for the Fourth of July.","yes","no","no","no","no","yes","yes","no","no","yes",{"$f":"\"Get-CsAdminRole | ? {$_.Cmdlets –match \"& CHAR(34) &B635& CHAR(34) &\"}\"","v":"Get-CsAdminRole | ? {$_.Cmdlets –match \"Set-CsRgsHolidaySet\"}"}]
["Set-CsRgsHoursOfBusiness","Set-CsRgsHoursOfBusiness",{"$f":"IF(ISTEXT(A636),(HYPERLINK(SUBSTITUTE(HLINK(A636),\".aspx\",\"\")&IF(C$1=2013,\"(v=ocs.15).aspx\",\"(v=ocs.14).aspx\"),A636)),\"\")","v":"Set-CsRgsHoursOfBusiness"},{"$f":"IF(ISTEXT(B636),(HYPERLINK(SUBSTITUTE(HLINK(B636),\".aspx\",\"\")&IF(D$1=2013,\"(v=ocs.15).aspx\",\"(v=ocs.14).aspx\"),B636)),\"\")","v":"Set-CsRgsHoursOfBusiness"},"Configures an existing set of Response Group business hours. Business hour sets are used to indicate the days of the week and the times of day when Response Group agents are typically available to answer phone calls.","yes","no","no","no","no","yes","yes","no","no","yes",{"$f":"\"Get-CsAdminRole | ? {$_.Cmdlets –match \"& CHAR(34) &B636& CHAR(34) &\"}\"","v":"Get-CsAdminRole | ? {$_.Cmdlets –match \"Set-CsRgsHoursOfBusiness\"}"}]
["Set-CsRgsQueue","Set-CsRgsQueue",{"$f":"IF(ISTEXT(A637),(HYPERLINK(SUBSTITUTE(HLINK(A637),\".aspx\",\"\")&IF(C$1=2013,\"(v=ocs.15).aspx\",\"(v=ocs.14).aspx\"),A637)),\"\")","v":"Set-CsRgsQueue"},{"$f":"IF(ISTEXT(B637),(HYPERLINK(SUBSTITUTE(HLINK(B637),\".aspx\",\"\")&IF(D$1=2013,\"(v=ocs.15).aspx\",\"(v=ocs.14).aspx\"),B637)),\"\")","v":"Set-CsRgsQueue"},"Modifies an existing Response Group queue. With the Response Group application, phone calls are put in a queue and callers are placed on hold until a Response Group agent is available to answer that call.","yes","no","no","no","no","yes","yes","no","no","yes",{"$f":"\"Get-CsAdminRole | ? {$_.Cmdlets –match \"& CHAR(34) &B637& CHAR(34) &\"}\"","v":"Get-CsAdminRole | ? {$_.Cmdlets –match \"Set-CsRgsQueue\"}"}]
["Set-CsRgsWorkflow","Set-CsRgsWorkflow",{"$f":"IF(ISTEXT(A638),(HYPERLINK(SUBSTITUTE(HLINK(A638),\".aspx\",\"\")&IF(C$1=2013,\"(v=ocs.15).aspx\",\"(v=ocs.14).aspx\"),A638)),\"\")","v":"Set-CsRgsWorkflow"},{"$f":"IF(ISTEXT(B638),(HYPERLINK(SUBSTITUTE(HLINK(B638),\".aspx\",\"\")&IF(D$1=2013,\"(v=ocs.15).aspx\",\"(v=ocs.14).aspx\"),B638)),\"\")","v":"Set-CsRgsWorkflow"},"Modifies an existing Response Group workflow. Workflows determine the actions that are taken when the Response Group application receives a phone call.","yes","no","no","no","no","yes","yes","no","no","yes",{"$f":"\"Get-CsAdminRole | ? {$_.Cmdlets –match \"& CHAR(34) &B638& CHAR(34) &\"}\"","v":"Get-CsAdminRole | ? {$_.Cmdlets –match \"Set-CsRgsWorkflow\"}"}]
["Set-CsRoutingConfiguration","Set-CsRoutingConfiguration",{"$f":"IF(ISTEXT(A639),(HYPERLINK(SUBSTITUTE(HLINK(A639),\".aspx\",\"\")&IF(C$1=2013,\"(v=ocs.15).aspx\",\"(v=ocs.14).aspx\"),A639)),\"\")","v":"Set-CsRoutingConfiguration"},{"$f":"IF(ISTEXT(B639),(HYPERLINK(SUBSTITUTE(HLINK(B639),\".aspx\",\"\")&IF(D$1=2013,\"(v=ocs.15).aspx\",\"(v=ocs.14).aspx\"),B639)),\"\")","v":"Set-CsRoutingConfiguration"},"Modifies a list of voice routes.","yes","no","no","no","no","no","yes","no","no","yes",{"$f":"\"Get-CsAdminRole | ? {$_.Cmdlets –match \"& CHAR(34) &B639& CHAR(34) &\"}\"","v":"Get-CsAdminRole | ? {$_.Cmdlets –match \"Set-CsRoutingConfiguration\"}"}]
["Set-CsServerApplication","Set-CsServerApplication",{"$f":"IF(ISTEXT(A640),(HYPERLINK(SUBSTITUTE(HLINK(A640),\".aspx\",\"\")&IF(C$1=2013,\"(v=ocs.15).aspx\",\"(v=ocs.14).aspx\"),A640)),\"\")","v":"Set-CsServerApplication"},{"$f":"IF(ISTEXT(B640),(HYPERLINK(SUBSTITUTE(HLINK(B640),\".aspx\",\"\")&IF(D$1=2013,\"(v=ocs.15).aspx\",\"(v=ocs.14).aspx\"),B640)),\"\")","v":"Set-CsServerApplication"},"Modifies the property values of an existing server application. Server applications are applications that are hosted by Microsoft Lync Server 2010.","yes","no","no","no","no","no","yes","no","no","no",{"$f":"\"Get-CsAdminRole | ? {$_.Cmdlets –match \"& CHAR(34) &B640& CHAR(34) &\"}\"","v":"Get-CsAdminRole | ? {$_.Cmdlets –match \"Set-CsServerApplication\"}"}]
["Set-CsSimpleUrlConfiguration","Set-CsSimpleUrlConfiguration",{"$f":"IF(ISTEXT(A641),(HYPERLINK(SUBSTITUTE(HLINK(A641),\".aspx\",\"\")&IF(C$1=2013,\"(v=ocs.15).aspx\",\"(v=ocs.14).aspx\"),A641)),\"\")","v":"Set-CsSimpleUrlConfiguration"},{"$f":"IF(ISTEXT(B641),(HYPERLINK(SUBSTITUTE(HLINK(B641),\".aspx\",\"\")&IF(D$1=2013,\"(v=ocs.15).aspx\",\"(v=ocs.14).aspx\"),B641)),\"\")","v":"Set-CsSimpleUrlConfiguration"},"Modifies an existing simple URL configuration collection. Simple URLs make it easier for users to join meetings and conferences, as well as making it easier for Administrators to log on to the Microsoft Lync Server 2010 Control Panel.","yes","no","no","no","no","no","yes","no","no","no",{"$f":"\"Get-CsAdminRole | ? {$_.Cmdlets –match \"& CHAR(34) &B641& CHAR(34) &\"}\"","v":"Get-CsAdminRole | ? {$_.Cmdlets –match \"Set-CsSimpleUrlConfiguration\"}"}]
["Set-CsSipDomain","Set-CsSipDomain",{"$f":"IF(ISTEXT(A642),(HYPERLINK(SUBSTITUTE(HLINK(A642),\".aspx\",\"\")&IF(C$1=2013,\"(v=ocs.15).aspx\",\"(v=ocs.14).aspx\"),A642)),\"\")","v":"Set-CsSipDomain"},{"$f":"IF(ISTEXT(B642),(HYPERLINK(SUBSTITUTE(HLINK(B642),\".aspx\",\"\")&IF(D$1=2013,\"(v=ocs.15).aspx\",\"(v=ocs.14).aspx\"),B642)),\"\")","v":"Set-CsSipDomain"},"Enables you to modify property values for the SIP domains in your organization. SIP domains are domains authorized to send and receive SIP traffic, and are used when assigning SIP addresses to users.","yes","no","no","no","no","no","yes","no","no","no",{"$f":"\"Get-CsAdminRole | ? {$_.Cmdlets –match \"& CHAR(34) &B642& CHAR(34) &\"}\"","v":"Get-CsAdminRole | ? {$_.Cmdlets –match \"Set-CsSipDomain\"}"}]
["Set-CsSipResponseCodeTranslationRule","Set-CsSipResponseCodeTranslationRule",{"$f":"IF(ISTEXT(A643),(HYPERLINK(SUBSTITUTE(HLINK(A643),\".aspx\",\"\")&IF(C$1=2013,\"(v=ocs.15).aspx\",\"(v=ocs.14).aspx\"),A643)),\"\")","v":"Set-CsSipResponseCodeTranslationRule"},{"$f":"IF(ISTEXT(B643),(HYPERLINK(SUBSTITUTE(HLINK(B643),\".aspx\",\"\")&IF(D$1=2013,\"(v=ocs.15).aspx\",\"(v=ocs.14).aspx\"),B643)),\"\")","v":"Set-CsSipResponseCodeTranslationRule"},"Modifies an existing SIP response code translation rule. These rules enable administrators to map SIP response codes with values between 400 and 699 to the values used by Microsoft Lync Server 2010.","yes","no","no","no","no","no","yes","no","no","yes",{"$f":"\"Get-CsAdminRole | ? {$_.Cmdlets –match \"& CHAR(34) &B643& CHAR(34) &\"}\"","v":"Get-CsAdminRole | ? {$_.Cmdlets –match \"Set-CsSipResponseCodeTranslationRule\"}"}]
["Set-CsSite","Set-CsSite",{"$f":"IF(ISTEXT(A644),(HYPERLINK(SUBSTITUTE(HLINK(A644),\".aspx\",\"\")&IF(C$1=2013,\"(v=ocs.15).aspx\",\"(v=ocs.14).aspx\"),A644)),\"\")","v":"Set-CsSite"},{"$f":"IF(ISTEXT(B644),(HYPERLINK(SUBSTITUTE(HLINK(B644),\".aspx\",\"\")&IF(D$1=2013,\"(v=ocs.15).aspx\",\"(v=ocs.14).aspx\"),B644)),\"\")","v":"Set-CsSite"},"Modifies the properties for any of your Microsoft Lync Server 2010 sites. Sites represent a collection of Lync Server 2010 pools and are typically designed around geographic regions. Lync Server includes two types of sites: data center sites and remote sites (branch office).","yes","no","no","no","no","no","yes","no","no","no",{"$f":"\"Get-CsAdminRole | ? {$_.Cmdlets –match \"& CHAR(34) &B644& CHAR(34) &\"}\"","v":"Get-CsAdminRole | ? {$_.Cmdlets –match \"Set-CsSite\"}"}]
["Set-CsStaticRoutingConfiguration","Set-CsStaticRoutingConfiguration",{"$f":"IF(ISTEXT(A645),(HYPERLINK(SUBSTITUTE(HLINK(A645),\".aspx\",\"\")&IF(C$1=2013,\"(v=ocs.15).aspx\",\"(v=ocs.14).aspx\"),A645)),\"\")","v":"Set-CsStaticRoutingConfiguration"},{"$f":"IF(ISTEXT(B645),(HYPERLINK(SUBSTITUTE(HLINK(B645),\".aspx\",\"\")&IF(D$1=2013,\"(v=ocs.15).aspx\",\"(v=ocs.14).aspx\"),B645)),\"\")","v":"Set-CsStaticRoutingConfiguration"},"Modifies an existing collection of static routing configuration settings.","yes","no","no","no","no","no","yes","no","no","no",{"$f":"\"Get-CsAdminRole | ? {$_.Cmdlets –match \"& CHAR(34) &B645& CHAR(34) &\"}\"","v":"Get-CsAdminRole | ? {$_.Cmdlets –match \"Set-CsStaticRoutingConfiguration\"}"}]
["Set-CsTestDevice","Set-CsTestDevice",{"$f":"IF(ISTEXT(A646),(HYPERLINK(SUBSTITUTE(HLINK(A646),\".aspx\",\"\")&IF(C$1=2013,\"(v=ocs.15).aspx\",\"(v=ocs.14).aspx\"),A646)),\"\")","v":"Set-CsTestDevice"},{"$f":"IF(ISTEXT(B646),(HYPERLINK(SUBSTITUTE(HLINK(B646),\".aspx\",\"\")&IF(D$1=2013,\"(v=ocs.15).aspx\",\"(v=ocs.14).aspx\"),B646)),\"\")","v":"Set-CsTestDevice"},"Modifies one or more of the device update management test devices that have been configured for use in your organization. Test devices provide a way for administrators to test firmware updates before those updates are distributed to all the devices in an organization.","yes","no","no","no","no","no","yes","no","no","yes",{"$f":"\"Get-CsAdminRole | ? {$_.Cmdlets –match \"& CHAR(34) &B646& CHAR(34) &\"}\"","v":"Get-CsAdminRole | ? {$_.Cmdlets –match \"Set-CsTestDevice\"}"}]
[null,"Set-CsTestUserCredential",{"$f":"IF(ISTEXT(A647),(HYPERLINK(SUBSTITUTE(HLINK(A647),\".aspx\",\"\")&IF(C$1=2013,\"(v=ocs.15).aspx\",\"(v=ocs.14).aspx\"),A647)),\"\")","v":""},{"$f":"IF(ISTEXT(B647),(HYPERLINK(SUBSTITUTE(HLINK(B647),\".aspx\",\"\")&IF(D$1=2013,\"(v=ocs.15).aspx\",\"(v=ocs.14).aspx\"),B647)),\"\")","v":"Set-CsTestUserCredential"},"Creates a new watcher node test user. Watcher nodes are computers that periodically use Microsoft System Center Operations Manager and Lync Server 2013 synthetic transactions to verify that Lync Server components are working as expected. This cmdlet was introduced in Lync Server 2013.","no","no","no","no","no","no","no","no","no","no",{"$f":"\"Get-CsAdminRole | ? {$_.Cmdlets –match \"& CHAR(34) &B647& CHAR(34) &\"}\"","v":"Get-CsAdminRole | ? {$_.Cmdlets –match \"Set-CsTestUserCredential\"}"}]
["Set-CsTrunkConfiguration","Set-CsTrunkConfiguration",{"$f":"IF(ISTEXT(A648),(HYPERLINK(SUBSTITUTE(HLINK(A648),\".aspx\",\"\")&IF(C$1=2013,\"(v=ocs.15).aspx\",\"(v=ocs.14).aspx\"),A648)),\"\")","v":"Set-CsTrunkConfiguration"},{"$f":"IF(ISTEXT(B648),(HYPERLINK(SUBSTITUTE(HLINK(B648),\".aspx\",\"\")&IF(D$1=2013,\"(v=ocs.15).aspx\",\"(v=ocs.14).aspx\"),B648)),\"\")","v":"Set-CsTrunkConfiguration"},"Modifies an existing trunk configuration that describes the settings for a trunking peer entity such as a public switched telephone network (PSTN) gateway, IP-public branch exchange (PBX), or Session Border Controller (SBC) at the service provider.","yes","no","no","no","no","no","yes","no","no","yes",{"$f":"\"Get-CsAdminRole | ? {$_.Cmdlets –match \"& CHAR(34) &B648& CHAR(34) &\"}\"","v":"Get-CsAdminRole | ? {$_.Cmdlets –match \"Set-CsTrunkConfiguration\"}"}]
["Set-CsTrustedApplication","Set-CsTrustedApplication",{"$f":"IF(ISTEXT(A649),(HYPERLINK(SUBSTITUTE(HLINK(A649),\".aspx\",\"\")&IF(C$1=2013,\"(v=ocs.15).aspx\",\"(v=ocs.14).aspx\"),A649)),\"\")","v":"Set-CsTrustedApplication"},{"$f":"IF(ISTEXT(B649),(HYPERLINK(SUBSTITUTE(HLINK(B649),\".aspx\",\"\")&IF(D$1=2013,\"(v=ocs.15).aspx\",\"(v=ocs.14).aspx\"),B649)),\"\")","v":"Set-CsTrustedApplication"},"Modifies the settings for a trusted application.","yes","no","no","no","no","no","yes","no","no","no","Get-CsAdminRole | ? {$_.Cmdlets –match \"Set-CsTrustedApplication\"}"]
["Set-CsTrustedApplicationEndpoint","Set-CsTrustedApplicationEndpoint",{"$f":"IF(ISTEXT(A650),(HYPERLINK(SUBSTITUTE(HLINK(A650),\".aspx\",\"\")&IF(C$1=2013,\"(v=ocs.15).aspx\",\"(v=ocs.14).aspx\"),A650)),\"\")","v":"Set-CsTrustedApplicationEndpoint"},{"$f":"IF(ISTEXT(B650),(HYPERLINK(SUBSTITUTE(HLINK(B650),\".aspx\",\"\")&IF(D$1=2013,\"(v=ocs.15).aspx\",\"(v=ocs.14).aspx\"),B650)),\"\")","v":"Set-CsTrustedApplicationEndpoint"},"Modifies an existing endpoint contact for a trusted application.","yes","no","no","no","no","no","yes","no","no","no","Get-CsAdminRole | ? {$_.Cmdlets –match \"Set-CsTrustedApplicationEndpoint\"}"]
["Set-CsTrustedApplicationPool","Set-CsTrustedApplicationPool",{"$f":"IF(ISTEXT(A651),(HYPERLINK(SUBSTITUTE(HLINK(A651),\".aspx\",\"\")&IF(C$1=2013,\"(v=ocs.15).aspx\",\"(v=ocs.14).aspx\"),A651)),\"\")","v":"Set-CsTrustedApplicationPool"},{"$f":"IF(ISTEXT(B651),(HYPERLINK(SUBSTITUTE(HLINK(B651),\".aspx\",\"\")&IF(D$1=2013,\"(v=ocs.15).aspx\",\"(v=ocs.14).aspx\"),B651)),\"\")","v":"Set-CsTrustedApplicationPool"},"Modifies a pool that contains the computers that host trusted applications.","yes","no","no","no","no","no","yes","no","no","no","Get-CsAdminRole | ? {$_.Cmdlets –match \"Set-CsTrustedApplicationPool\"}"]
["Set-CsUCPhoneConfiguration","Set-CsUCPhoneConfiguration",{"$f":"IF(ISTEXT(A652),(HYPERLINK(SUBSTITUTE(HLINK(A652),\".aspx\",\"\")&IF(C$1=2013,\"(v=ocs.15).aspx\",\"(v=ocs.14).aspx\"),A652)),\"\")","v":"Set-CsUCPhoneConfiguration"},{"$f":"IF(ISTEXT(B652),(HYPERLINK(SUBSTITUTE(HLINK(B652),\".aspx\",\"\")&IF(D$1=2013,\"(v=ocs.15).aspx\",\"(v=ocs.14).aspx\"),B652)),\"\")","v":"Set-CsUCPhoneConfiguration"},"Enables you to modify management options for Microsoft Lync 2010 Phone Edition. This includes such things as the required security mode and whether or not the phone should automatically be locked after a specified period of inactivity.","yes","no","no","no","no","no","yes","no","no","yes","Get-CsAdminRole | ? {$_.Cmdlets –match \"Set-CsUCPhoneConfiguration\"}"]
["Set-CsUICulture","Set-CsUICulture",{"$f":"IF(ISTEXT(A653),(HYPERLINK(SUBSTITUTE(HLINK(A653),\".aspx\",\"\")&IF(C$1=2013,\"(v=ocs.15).aspx\",\"(v=ocs.14).aspx\"),A653)),\"\")","v":"Set-CsUICulture"},{"$f":"IF(ISTEXT(B653),(HYPERLINK(SUBSTITUTE(HLINK(B653),\".aspx\",\"\")&IF(D$1=2013,\"(v=ocs.15).aspx\",\"(v=ocs.14).aspx\"),B653)),\"\")","v":"Set-CsUICulture"},"Enables you to modify the culture (that is, the language and regional settings) used by the Lync Server Management Shell.","no","no","no","no","no","no","no","no","no","no","Get-CsAdminRole | ? {$_.Cmdlets –match \"Set-CsUICulture\"}"]
["Set-CsUnassignedNumber","Set-CsUnassignedNumber",{"$f":"IF(ISTEXT(A654),(HYPERLINK(SUBSTITUTE(HLINK(A654),\".aspx\",\"\")&IF(C$1=2013,\"(v=ocs.15).aspx\",\"(v=ocs.14).aspx\"),A654)),\"\")","v":"Set-CsUnassignedNumber"},{"$f":"IF(ISTEXT(B654),(HYPERLINK(SUBSTITUTE(HLINK(B654),\".aspx\",\"\")&IF(D$1=2013,\"(v=ocs.15).aspx\",\"(v=ocs.14).aspx\"),B654)),\"\")","v":"Set-CsUnassignedNumber"},"Modifies an existing range of unassigned numbers and the routing rules that apply to those numbers.","yes","no","no","no","no","no","yes","no","no","yes","Get-CsAdminRole | ? {$_.Cmdlets –match \"Set-CsUnassignedNumber\"}"]
["Set-CsUser","Set-CsUser",{"$f":"IF(ISTEXT(A655),(HYPERLINK(SUBSTITUTE(HLINK(A655),\".aspx\",\"\")&IF(C$1=2013,\"(v=ocs.15).aspx\",\"(v=ocs.14).aspx\"),A655)),\"\")","v":"Set-CsUser"},{"$f":"IF(ISTEXT(B655),(HYPERLINK(SUBSTITUTE(HLINK(B655),\".aspx\",\"\")&IF(D$1=2013,\"(v=ocs.15).aspx\",\"(v=ocs.14).aspx\"),B655)),\"\")","v":"Set-CsUser"},"Modifies Microsoft Lync Server 2010 properties for an existing user account. Properties can be modified only for accounts that have been enabled for use with Lync Server 2010.","yes","no","no","no","no","no","yes","yes","no","no","Get-CsAdminRole | ? {$_.Cmdlets –match \"Set-CsUser\"}"]
["Set-CsUserAcp","Set-CsUserAcp",{"$f":"IF(ISTEXT(A656),(HYPERLINK(SUBSTITUTE(HLINK(A656),\".aspx\",\"\")&IF(C$1=2013,\"(v=ocs.15).aspx\",\"(v=ocs.14).aspx\"),A656)),\"\")","v":"Set-CsUserAcp"},{"$f":"IF(ISTEXT(B656),(HYPERLINK(SUBSTITUTE(HLINK(B656),\".aspx\",\"\")&IF(D$1=2013,\"(v=ocs.15).aspx\",\"(v=ocs.14).aspx\"),B656)),\"\")","v":"Set-CsUserAcp"},"Adds a new audio conferencing provider to a user or group of users, or modifies an existing audio conferencing provider already assigned to a user.","yes","no","no","no","no","no","no","yes","no","no","Get-CsAdminRole | ? {$_.Cmdlets –match \"Set-CsUserAcp\"}"]
["Set-CsUserDatabaseState","Set-CsUserDatabaseState",{"$f":"IF(ISTEXT(A657),(HYPERLINK(SUBSTITUTE(HLINK(A657),\".aspx\",\"\")&IF(C$1=2013,\"(v=ocs.15).aspx\",\"(v=ocs.14).aspx\"),A657)),\"\")","v":"Set-CsUserDatabaseState"},{"$f":"IF(ISTEXT(B657),(HYPERLINK(SUBSTITUTE(HLINK(B657),\".aspx\",\"\")&IF(D$1=2013,\"(v=ocs.15).aspx\",\"(v=ocs.14).aspx\"),B657)),\"\")","v":"Set-CsUserDatabaseState"},"Enables or disables one or more Microsoft Lync Server 2010 user databases.","yes","no","no","no","no","no","yes","no","no","no",{"$f":"\"Get-CsAdminRole | ? {$_.Cmdlets –match \"& CHAR(34) &B657& CHAR(34) &\"}\"","v":"Get-CsAdminRole | ? {$_.Cmdlets –match \"Set-CsUserDatabaseState\"}"}]
["Set-CsUserReplicatorConfiguration","Set-CsUserReplicatorConfiguration",{"$f":"IF(ISTEXT(A658),(HYPERLINK(SUBSTITUTE(HLINK(A658),\".aspx\",\"\")&IF(C$1=2013,\"(v=ocs.15).aspx\",\"(v=ocs.14).aspx\"),A658)),\"\")","v":"Set-CsUserReplicatorConfiguration"},{"$f":"IF(ISTEXT(B658),(HYPERLINK(SUBSTITUTE(HLINK(B658),\".aspx\",\"\")&IF(D$1=2013,\"(v=ocs.15).aspx\",\"(v=ocs.14).aspx\"),B658)),\"\")","v":"Set-CsUserReplicatorConfiguration"},"Modifies an existing collection of User Replicator configuration settings. The User Replicator periodically retrieves up-to-date user account information from Active Directory Domain Services (AD DS) and then synchronizes the new information with the current user data stored by Microsoft Lync Server 2010.","yes","no","no","no","no","no","yes","no","no","no","Get-CsAdminRole | ? {$_.Cmdlets –match \"Set-CsUserReplicatorConfiguration\"}"]
["Set-CsUserServer","Set-CsUserServer",{"$f":"IF(ISTEXT(A659),(HYPERLINK(SUBSTITUTE(HLINK(A659),\".aspx\",\"\")&IF(C$1=2013,\"(v=ocs.15).aspx\",\"(v=ocs.14).aspx\"),A659)),\"\")","v":"Set-CsUserServer"},{"$f":"IF(ISTEXT(B659),(HYPERLINK(SUBSTITUTE(HLINK(B659),\".aspx\",\"\")&IF(D$1=2013,\"(v=ocs.15).aspx\",\"(v=ocs.14).aspx\"),B659)),\"\")","v":"Set-CsUserServer"},"Enables you to modify an existing User Services pool. Among other things, the User Services pool provides presence information and helps to manage conferences.","yes","no","no","no","no","no","yes","no","no","no","Get-CsAdminRole | ? {$_.Cmdlets –match \"Set-CsUserServer\"}"]
["Set-CsUserServicesConfiguration","Set-CsUserServicesConfiguration",{"$f":"IF(ISTEXT(A660),(HYPERLINK(SUBSTITUTE(HLINK(A660),\".aspx\",\"\")&IF(C$1=2013,\"(v=ocs.15).aspx\",\"(v=ocs.14).aspx\"),A660)),\"\")","v":"Set-CsUserServicesConfiguration"},{"$f":"IF(ISTEXT(B660),(HYPERLINK(SUBSTITUTE(HLINK(B660),\".aspx\",\"\")&IF(D$1=2013,\"(v=ocs.15).aspx\",\"(v=ocs.14).aspx\"),B660)),\"\")","v":"Set-CsUserServicesConfiguration"},"Modifies an existing collection of User Services configuration settings. The User Services service is used to help maintain presence information and manage conferencing.","yes","no","no","no","no","no","yes","no","no","no","Get-CsAdminRole | ? {$_.Cmdlets –match \"Set-CsUserServicesConfiguration\"}"]
[null,"Set-CsUserServicesPolicy",{"$f":"IF(ISTEXT(A661),(HYPERLINK(SUBSTITUTE(HLINK(A661),\".aspx\",\"\")&IF(C$1=2013,\"(v=ocs.15).aspx\",\"(v=ocs.14).aspx\"),A661)),\"\")","v":""},{"$f":"IF(ISTEXT(B661),(HYPERLINK(SUBSTITUTE(HLINK(B661),\".aspx\",\"\")&IF(D$1=2013,\"(v=ocs.15).aspx\",\"(v=ocs.14).aspx\"),B661)),\"\")","v":"Set-CsUserServicesPolicy"},"Modifies an existing User Services policy. User Services policies determine whether or not a user's contacts are stored in Lync Server 2013 or in the Unified Contact Store. The Unified Contact Store provides a way for users to maintain a single set of contacts that can be accessed using Lync 2013, Outlook, and/or Outlook Web Access. This cmdlet was introduced in Lync Server 2013.","yes","no","no","no","no","no","yes","no","no","no","Get-CsAdminRole | ? {$_.Cmdlets –match \"Set-CsUserServicesPolicy\"}"]
["Set-CsVoiceConfiguration","Set-CsVoiceConfiguration",{"$f":"IF(ISTEXT(A662),(HYPERLINK(SUBSTITUTE(HLINK(A662),\".aspx\",\"\")&IF(C$1=2013,\"(v=ocs.15).aspx\",\"(v=ocs.14).aspx\"),A662)),\"\")","v":"Set-CsVoiceConfiguration"},{"$f":"IF(ISTEXT(B662),(HYPERLINK(SUBSTITUTE(HLINK(B662),\".aspx\",\"\")&IF(D$1=2013,\"(v=ocs.15).aspx\",\"(v=ocs.14).aspx\"),B662)),\"\")","v":"Set-CsVoiceConfiguration"},"Modifies a list of voice test configurations.","yes","no","no","no","no","no","yes","no","no","yes","Get-CsAdminRole | ? {$_.Cmdlets –match \"Set-CsVoiceConfiguration\"}"]
["Set-CsVoicemailReroutingConfiguration","Set-CsVoicemailReroutingConfiguration",{"$f":"IF(ISTEXT(A663),(HYPERLINK(SUBSTITUTE(HLINK(A663),\".aspx\",\"\")&IF(C$1=2013,\"(v=ocs.15).aspx\",\"(v=ocs.14).aspx\"),A663)),\"\")","v":"Set-CsVoicemailReroutingConfiguration"},{"$f":"IF(ISTEXT(B663),(HYPERLINK(SUBSTITUTE(HLINK(B663),\".aspx\",\"\")&IF(D$1=2013,\"(v=ocs.15).aspx\",\"(v=ocs.14).aspx\"),B663)),\"\")","v":"Set-CsVoicemailReroutingConfiguration"},"Modifies settings that provide public switched telephone network (PSTN) phone numbers to access Exchange Unified Messaging (UM) Subscriber Access and Auto Attendant features.","yes","no","no","no","no","no","yes","no","no","yes","Get-CsAdminRole | ? {$_.Cmdlets –match \"Set-CsVoicemailReroutingConfiguration\"}"]
["Set-CsVoiceNormalizationRule","Set-CsVoiceNormalizationRule",{"$f":"IF(ISTEXT(A664),(HYPERLINK(SUBSTITUTE(HLINK(A664),\".aspx\",\"\")&IF(C$1=2013,\"(v=ocs.15).aspx\",\"(v=ocs.14).aspx\"),A664)),\"\")","v":"Set-CsVoiceNormalizationRule"},{"$f":"IF(ISTEXT(B664),(HYPERLINK(SUBSTITUTE(HLINK(B664),\".aspx\",\"\")&IF(D$1=2013,\"(v=ocs.15).aspx\",\"(v=ocs.14).aspx\"),B664)),\"\")","v":"Set-CsVoiceNormalizationRule"},"Modifies a voice normalization rule. Voice normalization rules are used to convert a telephone dialing requirement (for example, dialing 9 to access an outside line) to the E.164 phone number format used by Microsoft Lync Server 2010.","yes","no","no","no","no","no","yes","no","no","yes","Get-CsAdminRole | ? {$_.Cmdlets –match \"Set-CsVoiceNormalizationRule\"}"]
["Set-CsVoicePolicy","Set-CsVoicePolicy",{"$f":"IF(ISTEXT(A665),(HYPERLINK(SUBSTITUTE(HLINK(A665),\".aspx\",\"\")&IF(C$1=2013,\"(v=ocs.15).aspx\",\"(v=ocs.14).aspx\"),A665)),\"\")","v":"Set-CsVoicePolicy"},{"$f":"IF(ISTEXT(B665),(HYPERLINK(SUBSTITUTE(HLINK(B665),\".aspx\",\"\")&IF(D$1=2013,\"(v=ocs.15).aspx\",\"(v=ocs.14).aspx\"),B665)),\"\")","v":"Set-CsVoicePolicy"},"Modifies an existing voice policy.","yes","no","no","no","no","no","yes","no","no","yes","Get-CsAdminRole | ? {$_.Cmdlets –match \"Set-CsVoicePolicy\"}"]
["Set-CsVoiceRoute","Set-CsVoiceRoute",{"$f":"IF(ISTEXT(A666),(HYPERLINK(SUBSTITUTE(HLINK(A666),\".aspx\",\"\")&IF(C$1=2013,\"(v=ocs.15).aspx\",\"(v=ocs.14).aspx\"),A666)),\"\")","v":"Set-CsVoiceRoute"},{"$f":"IF(ISTEXT(B666),(HYPERLINK(SUBSTITUTE(HLINK(B666),\".aspx\",\"\")&IF(D$1=2013,\"(v=ocs.15).aspx\",\"(v=ocs.14).aspx\"),B666)),\"\")","v":"Set-CsVoiceRoute"},"Modifies a voice route. Voice routes contain instructions that tell Microsoft Lync Server 2010 how to route calls from Enterprise Voice users to phone numbers on the public switched telephone network (PSTN) or a private branch exchange (PBX).","yes","no","no","no","no","no","yes","no","no","yes","Get-CsAdminRole | ? {$_.Cmdlets –match \"Set-CsVoiceRoute\"}"]
[null,"Set-CsVoiceRoutingPolicy",{"$f":"IF(ISTEXT(A667),(HYPERLINK(SUBSTITUTE(HLINK(A667),\".aspx\",\"\")&IF(C$1=2013,\"(v=ocs.15).aspx\",\"(v=ocs.14).aspx\"),A667)),\"\")","v":""},{"$f":"IF(ISTEXT(B667),(HYPERLINK(SUBSTITUTE(HLINK(B667),\".aspx\",\"\")&IF(D$1=2013,\"(v=ocs.15).aspx\",\"(v=ocs.14).aspx\"),B667)),\"\")","v":"Set-CsVoiceRoutingPolicy"},"Modifies an existing voice routing policy. Voice routing policies manage PSTN usages for users of hybrid voice. Hybrid voice enables users homed on Lync Online to take advantage of the Enterprise Voice capabilities available in an on-premises installation of Lync Server 2013. This cmdlet was introduced in Lync Server 2013.","yes","no","no","no","no","no","yes","no","no","yes","Get-CsAdminRole | ? {$_.Cmdlets –match \"Set-CsVoiceRoutingPolicy\"}"]
["Set-CsVoiceTestConfiguration","Set-CsVoiceTestConfiguration",{"$f":"IF(ISTEXT(A668),(HYPERLINK(SUBSTITUTE(HLINK(A668),\".aspx\",\"\")&IF(C$1=2013,\"(v=ocs.15).aspx\",\"(v=ocs.14).aspx\"),A668)),\"\")","v":"Set-CsVoiceTestConfiguration"},{"$f":"IF(ISTEXT(B668),(HYPERLINK(SUBSTITUTE(HLINK(B668),\".aspx\",\"\")&IF(D$1=2013,\"(v=ocs.15).aspx\",\"(v=ocs.14).aspx\"),B668)),\"\")","v":"Set-CsVoiceTestConfiguration"},"Modifies a test scenario you can use to test phone numbers against specified routes and rules.","yes","no","no","no","no","no","yes","no","no","yes","Get-CsAdminRole | ? {$_.Cmdlets –match \"Set-CsVoiceTestConfiguration\"}"]
[null,"Set-CsWatcherNodeConfiguration",{"$f":"IF(ISTEXT(A669),(HYPERLINK(SUBSTITUTE(HLINK(A669),\".aspx\",\"\")&IF(C$1=2013,\"(v=ocs.15).aspx\",\"(v=ocs.14).aspx\"),A669)),\"\")","v":""},{"$f":"IF(ISTEXT(B669),(HYPERLINK(SUBSTITUTE(HLINK(B669),\".aspx\",\"\")&IF(D$1=2013,\"(v=ocs.15).aspx\",\"(v=ocs.14).aspx\"),B669)),\"\")","v":"Set-CsWatcherNodeConfiguration"},"Modifies an existing collection of watcher node configuration settings. Watcher nodes are computers that periodically use Microsoft System Center Operations Manager and Lync Server 2013 synthetic transactions to verify that Lync Server components are working as expected. This cmdlet was introduced in Lync Server 2013.","yes","no","no","no","no","no","yes","no","no","no","Get-CsAdminRole | ? {$_.Cmdlets –match \"Set-CsWatcherNodeConfiguration\"}"]
["Set-CsWebServer","Set-CsWebServer",{"$f":"IF(ISTEXT(A670),(HYPERLINK(SUBSTITUTE(HLINK(A670),\".aspx\",\"\")&IF(C$1=2013,\"(v=ocs.15).aspx\",\"(v=ocs.14).aspx\"),A670)),\"\")","v":"Set-CsWebServer"},{"$f":"IF(ISTEXT(B670),(HYPERLINK(SUBSTITUTE(HLINK(B670),\".aspx\",\"\")&IF(D$1=2013,\"(v=ocs.15).aspx\",\"(v=ocs.14).aspx\"),B670)),\"\")","v":"Set-CsWebServer"},"Modifies one or more of the Web Server services used by Microsoft Lync Server 2010.","yes","no","no","no","no","no","yes","no","no","no","Get-CsAdminRole | ? {$_.Cmdlets –match \"Set-CsWebServer\"}"]
["Set-CsWebServiceConfiguration","Set-CsWebServiceConfiguration",{"$f":"IF(ISTEXT(A671),(HYPERLINK(SUBSTITUTE(HLINK(A671),\".aspx\",\"\")&IF(C$1=2013,\"(v=ocs.15).aspx\",\"(v=ocs.14).aspx\"),A671)),\"\")","v":"Set-CsWebServiceConfiguration"},{"$f":"IF(ISTEXT(B671),(HYPERLINK(SUBSTITUTE(HLINK(B671),\".aspx\",\"\")&IF(D$1=2013,\"(v=ocs.15).aspx\",\"(v=ocs.14).aspx\"),B671)),\"\")","v":"Set-CsWebServiceConfiguration"},"Modifies an existing collection of Web Services configuration settings.","yes","no","no","no","no","no","yes","no","no","no","Get-CsAdminRole | ? {$_.Cmdlets –match \"Set-CsWebServiceConfiguration\"}"]
[null,"Set-CsXmppAllowedPartner",{"$f":"IF(ISTEXT(A672),(HYPERLINK(SUBSTITUTE(HLINK(A672),\".aspx\",\"\")&IF(C$1=2013,\"(v=ocs.15).aspx\",\"(v=ocs.14).aspx\"),A672)),\"\")","v":""},{"$f":"IF(ISTEXT(B672),(HYPERLINK(SUBSTITUTE(HLINK(B672),\".aspx\",\"\")&IF(D$1=2013,\"(v=ocs.15).aspx\",\"(v=ocs.14).aspx\"),B672)),\"\")","v":"Set-CsXmppAllowedPartner"},"Modifies an existing XMPP allowed partner. The extensible Messaging and Presence Protocol (XMPP) is an open-standard communications protocol for exchanging messages using XML. An allowed partner is an IM and presence provider whose users are allowed to exchange instant messages and presence information with your Lync Server 2013 users. This cmdlet was introduced in Lync Server 2013.","yes","no","no","no","no","no","yes","no","no","no","Get-CsAdminRole | ? {$_.Cmdlets –match \"Set-CsXmppAllowedPartner\"}"]
[null,"Set-CsXmppGatewayConfiguration",{"$f":"IF(ISTEXT(A673),(HYPERLINK(SUBSTITUTE(HLINK(A673),\".aspx\",\"\")&IF(C$1=2013,\"(v=ocs.15).aspx\",\"(v=ocs.14).aspx\"),A673)),\"\")","v":""},{"$f":"IF(ISTEXT(B673),(HYPERLINK(SUBSTITUTE(HLINK(B673),\".aspx\",\"\")&IF(D$1=2013,\"(v=ocs.15).aspx\",\"(v=ocs.14).aspx\"),B673)),\"\")","v":"Set-CsXmppGatewayConfiguration"},"Modifies the XMPP gateway configuration settings in use in the organization. The extensible Messaging and Presence Protocol (XMPP) is an open-standard communications protocol for exchanging messages using XML. XMPP gateways enable Lync Server 2013 users to exchange instant message and presence information with users from IM and presence providers that employ XMPP. This cmdlet was introduced in Lync Server 2013.","yes","no","no","no","no","no","yes","no","no","no","Get-CsAdminRole | ? {$_.Cmdlets –match \"Set-CsXmppGatewayConfiguration\"}"]
[null,"Show-CsClsLogging",{"$f":"IF(ISTEXT(A674),(HYPERLINK(SUBSTITUTE(HLINK(A674),\".aspx\",\"\")&IF(C$1=2013,\"(v=ocs.15).aspx\",\"(v=ocs.14).aspx\"),A674)),\"\")","v":""},{"$f":"IF(ISTEXT(B674),(HYPERLINK(SUBSTITUTE(HLINK(B674),\".aspx\",\"\")&IF(D$1=2013,\"(v=ocs.15).aspx\",\"(v=ocs.14).aspx\"),B674)),\"\")","v":"Show-CsClsLogging"},"Shows the current status of the centralized logging service. (That is, shows which centralized logging scenarios are currently active.) Centralized logging provides a way for administrators to simultaneously enable or disable Lync Server 2013 tracing on multiple computers. This cmdlet was introduced in Lync Server 2013.","yes","no","no","no","no","no","yes","no","no","no","Get-CsAdminRole | ? {$_.Cmdlets –match \"Show-CsClsLogging\"}"]
[null,"Start-CsClsLogging",{"$f":"IF(ISTEXT(A675),(HYPERLINK(SUBSTITUTE(HLINK(A675),\".aspx\",\"\")&IF(C$1=2013,\"(v=ocs.15).aspx\",\"(v=ocs.14).aspx\"),A675)),\"\")","v":""},{"$f":"IF(ISTEXT(B675),(HYPERLINK(SUBSTITUTE(HLINK(B675),\".aspx\",\"\")&IF(D$1=2013,\"(v=ocs.15).aspx\",\"(v=ocs.14).aspx\"),B675)),\"\")","v":"Start-CsClsLogging"},"Starts the specified scenario centralized logging service scenario. Centralized logging provides a way for administrators to simultaneously enable or disable Lync Server 2013 tracing on multiple computers. This cmdlet was introduced in Lync Server 2013.","yes","no","no","no","no","no","yes","no","no","no","Get-CsAdminRole | ? {$_.Cmdlets –match \"Start-CsClsLogging\"}"]
["Start-CsWindowsService","Start-CsWindowsService",{"$f":"IF(ISTEXT(A676),(HYPERLINK(SUBSTITUTE(HLINK(A676),\".aspx\",\"\")&IF(C$1=2013,\"(v=ocs.15).aspx\",\"(v=ocs.14).aspx\"),A676)),\"\")","v":"Start-CsWindowsService"},{"$f":"IF(ISTEXT(B676),(HYPERLINK(SUBSTITUTE(HLINK(B676),\".aspx\",\"\")&IF(D$1=2013,\"(v=ocs.15).aspx\",\"(v=ocs.14).aspx\"),B676)),\"\")","v":"Start-CsWindowsService"},"Start-CsWindowsService enables you to start a Microsoft Lync Server 2010 service.","yes","no","no","no","no","no","yes","no","no","no",{"$f":"\"Get-CsAdminRole | ? {$_.Cmdlets –match \"& CHAR(34) &B676& CHAR(34) &\"}\"","v":"Get-CsAdminRole | ? {$_.Cmdlets –match \"Start-CsWindowsService\"}"}]
[null,"Stop-CsClsLogging",{"$f":"IF(ISTEXT(A677),(HYPERLINK(SUBSTITUTE(HLINK(A677),\".aspx\",\"\")&IF(C$1=2013,\"(v=ocs.15).aspx\",\"(v=ocs.14).aspx\"),A677)),\"\")","v":""},{"$f":"IF(ISTEXT(B677),(HYPERLINK(SUBSTITUTE(HLINK(B677),\".aspx\",\"\")&IF(D$1=2013,\"(v=ocs.15).aspx\",\"(v=ocs.14).aspx\"),B677)),\"\")","v":"Stop-CsClsLogging"},"Stops the specified scenario centralized logging service scenario. Centralized logging provides a way for administrators to simultaneously enable or disable Lync Server 2013 tracing on multiple computers. This cmdlet was introduced in Lync Server 2013.","yes","no","no","no","no","no","yes","no","no","no","Get-CsAdminRole | ? {$_.Cmdlets –match \"Stop-CsClsLogging\"}"]
["Stop-CsWindowsService","Stop-CsWindowsService",{"$f":"IF(ISTEXT(A678),(HYPERLINK(SUBSTITUTE(HLINK(A678),\".aspx\",\"\")&IF(C$1=2013,\"(v=ocs.15).aspx\",\"(v=ocs.14).aspx\"),A678)),\"\")","v":"Stop-CsWindowsService"},{"$f":"IF(ISTEXT(B678),(HYPERLINK(SUBSTITUTE(HLINK(B678),\".aspx\",\"\")&IF(D$1=2013,\"(v=ocs.15).aspx\",\"(v=ocs.14).aspx\"),B678)),\"\")","v":"Stop-CsWindowsService"},"Stop-CsWindowsService enables you to stop a Microsoft Lync Server 2010 service.","yes","no","no","no","no","no","yes","no","no","no","Get-CsAdminRole | ? {$_.Cmdlets –match \"Stop-CsWindowsService\"}"]
[null,"Sync-CsClsLogging",{"$f":"IF(ISTEXT(A679),(HYPERLINK(SUBSTITUTE(HLINK(A679),\".aspx\",\"\")&IF(C$1=2013,\"(v=ocs.15).aspx\",\"(v=ocs.14).aspx\"),A679)),\"\")","v":""},{"$f":"IF(ISTEXT(B679),(HYPERLINK(SUBSTITUTE(HLINK(B679),\".aspx\",\"\")&IF(D$1=2013,\"(v=ocs.15).aspx\",\"(v=ocs.14).aspx\"),B679)),\"\")","v":"Sync-CsClsLogging"},"Flushes the centralized logging service cache. Centralized logging provides a way for administrators to simultaneously enable or disable Lync Server 2013 tracing on multiple computers. This cmdlet was introduced in Lync Server 2013.","yes","no","no","no","no","no","yes","no","no","no","Get-CsAdminRole | ? {$_.Cmdlets –match \"Sync-CsClsLogging\"}"]
[null,"Sync-CsUserData",{"$f":"IF(ISTEXT(A680),(HYPERLINK(SUBSTITUTE(HLINK(A680),\".aspx\",\"\")&IF(C$1=2013,\"(v=ocs.15).aspx\",\"(v=ocs.14).aspx\"),A680)),\"\")","v":""},{"$f":"IF(ISTEXT(B680),(HYPERLINK(SUBSTITUTE(HLINK(B680),\".aspx\",\"\")&IF(D$1=2013,\"(v=ocs.15).aspx\",\"(v=ocs.14).aspx\"),B680)),\"\")","v":"Sync-CsUserData"},"Synchronizes user data between a pair of Lync Server 2013 pools. This cmdlet was introduced in Lync Server 2013.","no","no","no","no","no","no","no","no","no","no",{"$f":"\"Get-CsAdminRole | ? {$_.Cmdlets –match \"& CHAR(34) &B680& CHAR(34) &\"}\"","v":"Get-CsAdminRole | ? {$_.Cmdlets –match \"Sync-CsUserData\"}"}]
["Test-CsAddressBookService","Test-CsAddressBookService",{"$f":"IF(ISTEXT(A681),(HYPERLINK(SUBSTITUTE(HLINK(A681),\".aspx\",\"\")&IF(C$1=2013,\"(v=ocs.15).aspx\",\"(v=ocs.14).aspx\"),A681)),\"\")","v":"Test-CsAddressBookService"},{"$f":"IF(ISTEXT(B681),(HYPERLINK(SUBSTITUTE(HLINK(B681),\".aspx\",\"\")&IF(D$1=2013,\"(v=ocs.15).aspx\",\"(v=ocs.14).aspx\"),B681)),\"\")","v":"Test-CsAddressBookService"},"Tests the ability of a user to access the server that hosts the Address Book Download Web service.","yes","no","yes","no","no","no","yes","no","no","no","Get-CsAdminRole | ? {$_.Cmdlets –match \"Test-CsAddressBookService\"}"]
["Test-CsAddressBookWebQuery","Test-CsAddressBookWebQuery",{"$f":"IF(ISTEXT(A682),(HYPERLINK(SUBSTITUTE(HLINK(A682),\".aspx\",\"\")&IF(C$1=2013,\"(v=ocs.15).aspx\",\"(v=ocs.14).aspx\"),A682)),\"\")","v":"Test-CsAddressBookWebQuery"},{"$f":"IF(ISTEXT(B682),(HYPERLINK(SUBSTITUTE(HLINK(B682),\".aspx\",\"\")&IF(D$1=2013,\"(v=ocs.15).aspx\",\"(v=ocs.14).aspx\"),B682)),\"\")","v":"Test-CsAddressBookWebQuery"},"Tests the ability of a user to search for, and return, information from the Address Book by using the Address Book Web Query service.","yes","no","yes","no","no","no","yes","no","no","no","Get-CsAdminRole | ? {$_.Cmdlets –match \"Test-CsAddressBookWebQuery\"}"]
["Test-CsAVConference","Test-CsASConference",{"$f":"IF(ISTEXT(A683),(HYPERLINK(SUBSTITUTE(HLINK(A683),\".aspx\",\"\")&IF(C$1=2013,\"(v=ocs.15).aspx\",\"(v=ocs.14).aspx\"),A683)),\"\")","v":"Test-CsAVConference"},{"$f":"IF(ISTEXT(B683),(HYPERLINK(SUBSTITUTE(HLINK(B683),\".aspx\",\"\")&IF(D$1=2013,\"(v=ocs.15).aspx\",\"(v=ocs.14).aspx\"),B683)),\"\")","v":"Test-CsASConference"},"Tests the ability of a pair of users to take part in an audio/video (A/V) conference.","yes","no","yes","no","no","no","yes","no","no","no","Get-CsAdminRole | ? {$_.Cmdlets –match \"Test-CsASConference\"}"]
[null,"Test-CsAudioConferencingProvider",{"$f":"IF(ISTEXT(A684),(HYPERLINK(SUBSTITUTE(HLINK(A684),\".aspx\",\"\")&IF(C$1=2013,\"(v=ocs.15).aspx\",\"(v=ocs.14).aspx\"),A684)),\"\")","v":""},{"$f":"IF(ISTEXT(B684),(HYPERLINK(SUBSTITUTE(HLINK(B684),\".aspx\",\"\")&IF(D$1=2013,\"(v=ocs.15).aspx\",\"(v=ocs.14).aspx\"),B684)),\"\")","v":"Test-CsAudioConferencingProvider"},"Tests to see if a user can connect to his or her audio conferencing provider. An audio conferencing provider is a third-party company that provides organizations with conferencing services. Among other things, audio conferencing providers enable users located off site, and not connected to the corporate network or the Internet, to participate in the audio portion of a conference or meeting.","yes","no","yes","no","no","no","yes","no","no","yes","Get-CsAdminRole | ? {$_.Cmdlets –match \"Test-CsAudioConferencingProvider\"}"]
["Test-CsAVConference","Test-CsAVConference",{"$f":"IF(ISTEXT(A685),(HYPERLINK(SUBSTITUTE(HLINK(A685),\".aspx\",\"\")&IF(C$1=2013,\"(v=ocs.15).aspx\",\"(v=ocs.14).aspx\"),A685)),\"\")","v":"Test-CsAVConference"},{"$f":"IF(ISTEXT(B685),(HYPERLINK(SUBSTITUTE(HLINK(B685),\".aspx\",\"\")&IF(D$1=2013,\"(v=ocs.15).aspx\",\"(v=ocs.14).aspx\"),B685)),\"\")","v":"Test-CsAVConference"},"Tests the ability of a pair of users to take part in an audio/video (A/V) conference. This cmdlet was introduced in Lync Server 2010.","yes","no","yes","no","no","no","yes","no","no","no","Get-CsAdminRole | ? {$_.Cmdlets –match \"Test-CsAVConference\"}"]
[null,"Test-CsAVEdgeConnectivity",{"$f":"IF(ISTEXT(A686),(HYPERLINK(SUBSTITUTE(HLINK(A686),\".aspx\",\"\")&IF(C$1=2013,\"(v=ocs.15).aspx\",\"(v=ocs.14).aspx\"),A686)),\"\")","v":""},{"$f":"IF(ISTEXT(B686),(HYPERLINK(SUBSTITUTE(HLINK(B686),\".aspx\",\"\")&IF(D$1=2013,\"(v=ocs.15).aspx\",\"(v=ocs.14).aspx\"),B686)),\"\")","v":"Test-CsAVEdgeConnectivity"},"Verifies connectivity through the A/V Edge server. This cmdlet was introduced in Lync Server 2013.","yes","no","no","no","no","no","yes","no","no","no","Get-CsAdminRole | ? {$_.Cmdlets –match \"Test-CsAVEdgeConnectivity\"}"]
["Test-CsCertificateConfiguration","Test-CsCertificateConfiguration",{"$f":"IF(ISTEXT(A687),(HYPERLINK(SUBSTITUTE(HLINK(A687),\".aspx\",\"\")&IF(C$1=2013,\"(v=ocs.15).aspx\",\"(v=ocs.14).aspx\"),A687)),\"\")","v":"Test-CsCertificateConfiguration"},{"$f":"IF(ISTEXT(B687),(HYPERLINK(SUBSTITUTE(HLINK(B687),\".aspx\",\"\")&IF(D$1=2013,\"(v=ocs.15).aspx\",\"(v=ocs.14).aspx\"),B687)),\"\")","v":"Test-CsCertificateConfiguration"},"Returns information about the Microsoft Lync Server 2010 certificates being used on the local computer.","no","no","no","no","no","no","no","no","no","no","Get-CsAdminRole | ? {$_.Cmdlets –match \"Test-CsCertificateConfiguration\"}"]
["Test-CsClientAuth",null,{"$f":"IF(ISTEXT(A688),(HYPERLINK(SUBSTITUTE(HLINK(A688),\".aspx\",\"\")&IF(C$1=2013,\"(v=ocs.15).aspx\",\"(v=ocs.14).aspx\"),A688)),\"\")","v":"Test-CsClientAuth"},{"$f":"IF(ISTEXT(B688),(HYPERLINK(SUBSTITUTE(HLINK(B688),\".aspx\",\"\")&IF(D$1=2013,\"(v=ocs.15).aspx\",\"(v=ocs.14).aspx\"),B688)),\"\")","v":""},"Determines whether or not a user can log on to Lync Server by using a certificate downloaded from the certificate provisioning service. This cmdlet was introduced in Microsoft Lync Server 2010.","yes","no","yes","no","no","no","yes","no","no","no",{"$f":"\"Get-CsAdminRole | ? {$_.Cmdlets –match \"& CHAR(34) &A688& CHAR(34) &\"}\"","v":"Get-CsAdminRole | ? {$_.Cmdlets –match \"Test-CsClientAuth\"}"}]
["Test-CsComputer","Test-CsComputer",{"$f":"IF(ISTEXT(A689),(HYPERLINK(SUBSTITUTE(HLINK(A689),\".aspx\",\"\")&IF(C$1=2013,\"(v=ocs.15).aspx\",\"(v=ocs.14).aspx\"),A689)),\"\")","v":"Test-CsComputer"},{"$f":"IF(ISTEXT(B689),(HYPERLINK(SUBSTITUTE(HLINK(B689),\".aspx\",\"\")&IF(D$1=2013,\"(v=ocs.15).aspx\",\"(v=ocs.14).aspx\"),B689)),\"\")","v":"Test-CsComputer"},"Test-CsComputer verifies the status of the Microsoft Lync Server 2010 services running on the local computer. The cmdlet also verifies that the appropriate Lync Server 2010 Active Directory groups have been added to the corresponding local groups on the computer, and that the necessary computer firewall ports have been opened.","no","no","no","no","no","no","no","no","no","no",{"$f":"\"Get-CsAdminRole | ? {$_.Cmdlets –match \"& CHAR(34) &B689& CHAR(34) &\"}\"","v":"Get-CsAdminRole | ? {$_.Cmdlets –match \"Test-CsComputer\"}"}]
[null,"Test-CsDatabase",{"$f":"IF(ISTEXT(A690),(HYPERLINK(SUBSTITUTE(HLINK(A690),\".aspx\",\"\")&IF(C$1=2013,\"(v=ocs.15).aspx\",\"(v=ocs.14).aspx\"),A690)),\"\")","v":""},{"$f":"IF(ISTEXT(B690),(HYPERLINK(SUBSTITUTE(HLINK(B690),\".aspx\",\"\")&IF(D$1=2013,\"(v=ocs.15).aspx\",\"(v=ocs.14).aspx\"),B690)),\"\")","v":"Test-CsDatabase"},"Tests the configuration of the Lync Server 2013 databases. This cmdlet was introduced in Lync Server 2013.","no","no","no","no","no","no","no","no","no","no","Get-CsAdminRole | ? {$_.Cmdlets –match \"Test-CsDatabase\"}"]
[null,"Test-CsDataConference",{"$f":"IF(ISTEXT(A691),(HYPERLINK(SUBSTITUTE(HLINK(A691),\".aspx\",\"\")&IF(C$1=2013,\"(v=ocs.15).aspx\",\"(v=ocs.14).aspx\"),A691)),\"\")","v":""},{"$f":"IF(ISTEXT(B691),(HYPERLINK(SUBSTITUTE(HLINK(B691),\".aspx\",\"\")&IF(D$1=2013,\"(v=ocs.15).aspx\",\"(v=ocs.14).aspx\"),B691)),\"\")","v":"Test-CsDataConference"},"Verifies whether or not a pair of users can participate in a Lync Server 2013 web conference that includes activities such as sharing or viewing PowerPoint slides, whiteboards, or polls. The cmdlet also verifies that the Lync Server web conferencing service can discover Office Web Apps Server and that a client can upload a PowerPoint file for broadcast by Office Web Apps Server. This cmdlet was introduced in Lync Server 2013. ","yes","no","no","no","no","no","yes","no","no","no","Get-CsAdminRole | ? {$_.Cmdlets –match \"Test-CsDataConference\"}"]
["Test-CsDialInConferencing","Test-CsDialInConferencing",{"$f":"IF(ISTEXT(A692),(HYPERLINK(SUBSTITUTE(HLINK(A692),\".aspx\",\"\")&IF(C$1=2013,\"(v=ocs.15).aspx\",\"(v=ocs.14).aspx\"),A692)),\"\")","v":"Test-CsDialInConferencing"},{"$f":"IF(ISTEXT(B692),(HYPERLINK(SUBSTITUTE(HLINK(B692),\".aspx\",\"\")&IF(D$1=2013,\"(v=ocs.15).aspx\",\"(v=ocs.14).aspx\"),B692)),\"\")","v":"Test-CsDialInConferencing"},"Test-CsDialInConferencing checks to see if a user can take part in a dial-in conferencing session.","yes","no","yes","no","no","no","yes","no","no","no","Get-CsAdminRole | ? {$_.Cmdlets –match \"Test-CsDialInConferencing\"}"]
["Test-CsDialPlan","Test-CsDialPlan",{"$f":"IF(ISTEXT(A693),(HYPERLINK(SUBSTITUTE(HLINK(A693),\".aspx\",\"\")&IF(C$1=2013,\"(v=ocs.15).aspx\",\"(v=ocs.14).aspx\"),A693)),\"\")","v":"Test-CsDialPlan"},{"$f":"IF(ISTEXT(B693),(HYPERLINK(SUBSTITUTE(HLINK(B693),\".aspx\",\"\")&IF(D$1=2013,\"(v=ocs.15).aspx\",\"(v=ocs.14).aspx\"),B693)),\"\")","v":"Test-CsDialPlan"},"Tests a telephone number against a dial plan (formerly known as a location profile) and returns the normalization rule that will be applied to the number as well as the translated number after the normalization rule has been applied.","yes","no","no","no","no","no","yes","no","no","yes","Get-CsAdminRole | ? {$_.Cmdlets –match \"Test-CsDialPlan\"}"]
[null,"Test-CsExStorageConnectivity",{"$f":"IF(ISTEXT(A694),(HYPERLINK(SUBSTITUTE(HLINK(A694),\".aspx\",\"\")&IF(C$1=2013,\"(v=ocs.15).aspx\",\"(v=ocs.14).aspx\"),A694)),\"\")","v":""},{"$f":"IF(ISTEXT(B694),(HYPERLINK(SUBSTITUTE(HLINK(B694),\".aspx\",\"\")&IF(D$1=2013,\"(v=ocs.15).aspx\",\"(v=ocs.14).aspx\"),B694)),\"\")","v":"Test-CsExStorageConnectivity"},"Verifies that the Lync Server Storage Service is working on a Front End Server. This is done by creating a test email message in the specified Exchange mailbox and then optionally deleting that message at the end of the text. Test-CsExStorageConnectivity also verifies that Exchange archiving is working as expected. This cmdlet was introduced in Lync Server 2013.","yes","no","no","no","no","no","yes","no","no","no","Get-CsAdminRole | ? {$_.Cmdlets –match \"Test-CsExStorageConnectivity\"}"]
[null,"Test-CsExStorageNotification",{"$f":"IF(ISTEXT(A695),(HYPERLINK(SUBSTITUTE(HLINK(A695),\".aspx\",\"\")&IF(C$1=2013,\"(v=ocs.15).aspx\",\"(v=ocs.14).aspx\"),A695)),\"\")","v":""},{"$f":"IF(ISTEXT(B695),(HYPERLINK(SUBSTITUTE(HLINK(B695),\".aspx\",\"\")&IF(D$1=2013,\"(v=ocs.15).aspx\",\"(v=ocs.14).aspx\"),B695)),\"\")","v":"Test-CsExStorageNotification"},"Verifies that the Lync Server Storage Service running on a Front End server can subscribe to the Microsoft Exchange Server 2013 mailbox notification service. This is done by having the cmdlet subscribe to the service, create an item, verify that notification of the new item is received, and then, optionally, delete that item unsubscribe from the service. This cmdlet was introduced in Lync Server 2013.","yes","no","no","no","no","no","yes","no","no","no","Get-CsAdminRole | ? {$_.Cmdlets –match \"Test-CsExStorageNotification\"}"]
[null,"Test-CsExUMConnectivity",{"$f":"IF(ISTEXT(A696),(HYPERLINK(SUBSTITUTE(HLINK(A696),\".aspx\",\"\")&IF(C$1=2013,\"(v=ocs.15).aspx\",\"(v=ocs.14).aspx\"),A696)),\"\")","v":""},{"$f":"IF(ISTEXT(B696),(HYPERLINK(SUBSTITUTE(HLINK(B696),\".aspx\",\"\")&IF(D$1=2013,\"(v=ocs.15).aspx\",\"(v=ocs.14).aspx\"),B696)),\"\")","v":"Test-CsExUMConnectivity"},"Verifies that a test user can connect to Exchange Unified Messaging. This cmdlet was introduced in Lync Server 2013.","yes","no","no","no","no","no","yes","no","no","yes","Get-CsAdminRole | ? {$_.Cmdlets –match \"Test-CsExUMConnectivity\"}"]
[null,"Test-CsExUMVoiceMail",{"$f":"IF(ISTEXT(A697),(HYPERLINK(SUBSTITUTE(HLINK(A697),\".aspx\",\"\")&IF(C$1=2013,\"(v=ocs.15).aspx\",\"(v=ocs.14).aspx\"),A697)),\"\")","v":""},{"$f":"IF(ISTEXT(B697),(HYPERLINK(SUBSTITUTE(HLINK(B697),\".aspx\",\"\")&IF(D$1=2013,\"(v=ocs.15).aspx\",\"(v=ocs.14).aspx\"),B697)),\"\")","v":"Test-CsExUMVoiceMail"},"Verifies that a user can connect to Exchange Unified Messaging and leave a voice mail message for another user. This cmdlet was introduced in Lync Server 2013.","yes","no","no","no","no","no","yes","no","no","yes","Get-CsAdminRole | ? {$_.Cmdlets –match \"Test-CsExUMVoiceMail\"}"]
["Test-CsFederatedPartner","Test-CsFederatedPartner",{"$f":"IF(ISTEXT(A698),(HYPERLINK(SUBSTITUTE(HLINK(A698),\".aspx\",\"\")&IF(C$1=2013,\"(v=ocs.15).aspx\",\"(v=ocs.14).aspx\"),A698)),\"\")","v":"Test-CsFederatedPartner"},{"$f":"IF(ISTEXT(B698),(HYPERLINK(SUBSTITUTE(HLINK(B698),\".aspx\",\"\")&IF(D$1=2013,\"(v=ocs.15).aspx\",\"(v=ocs.14).aspx\"),B698)),\"\")","v":"Test-CsFederatedPartner"},"Verifies the ability to connect to a federated domain.","yes","no","yes","no","no","no","yes","no","no","no","Get-CsAdminRole | ? {$_.Cmdlets –match \"Test-CsFederatedPartner\"}"]
["Test-CsGroupExpansion","Test-CsGroupExpansion",{"$f":"IF(ISTEXT(A699),(HYPERLINK(SUBSTITUTE(HLINK(A699),\".aspx\",\"\")&IF(C$1=2013,\"(v=ocs.15).aspx\",\"(v=ocs.14).aspx\"),A699)),\"\")","v":"Test-CsGroupExpansion"},{"$f":"IF(ISTEXT(B699),(HYPERLINK(SUBSTITUTE(HLINK(B699),\".aspx\",\"\")&IF(D$1=2013,\"(v=ocs.15).aspx\",\"(v=ocs.14).aspx\"),B699)),\"\")","v":"Test-CsGroupExpansion"},"Tests the ability of a user to employ group expansion. Microsoft Lync Server 2010 enables users to configure an Active Directory distribution group as a contact. When you \"expand\" a group you will see the name and presence information for each member of the group.","yes","no","yes","no","no","no","yes","no","no","no","Get-CsAdminRole | ? {$_.Cmdlets –match \"Test-CsGroupExpansion\"}"]
["Test-CsGroupIM","Test-CsGroupIM",{"$f":"IF(ISTEXT(A700),(HYPERLINK(SUBSTITUTE(HLINK(A700),\".aspx\",\"\")&IF(C$1=2013,\"(v=ocs.15).aspx\",\"(v=ocs.14).aspx\"),A700)),\"\")","v":"Test-CsGroupIM"},{"$f":"IF(ISTEXT(B700),(HYPERLINK(SUBSTITUTE(HLINK(B700),\".aspx\",\"\")&IF(D$1=2013,\"(v=ocs.15).aspx\",\"(v=ocs.14).aspx\"),B700)),\"\")","v":"Test-CsGroupIM"},"Tests the ability of two users to conduct an instant messaging (IM) conference. Test-CsGroupIM is a \"synthetic transaction\": a simulation of common Microsoft Lync Server 2010 activities used for health and performance monitoring.","yes","no","yes","no","no","no","yes","no","no","no","Get-CsAdminRole | ? {$_.Cmdlets –match \"Test-CsGroupIM\"}"]
["Test-CsIM","Test-CsIM",{"$f":"IF(ISTEXT(A701),(HYPERLINK(SUBSTITUTE(HLINK(A701),\".aspx\",\"\")&IF(C$1=2013,\"(v=ocs.15).aspx\",\"(v=ocs.14).aspx\"),A701)),\"\")","v":"Test-CsIM"},{"$f":"IF(ISTEXT(B701),(HYPERLINK(SUBSTITUTE(HLINK(B701),\".aspx\",\"\")&IF(D$1=2013,\"(v=ocs.15).aspx\",\"(v=ocs.14).aspx\"),B701)),\"\")","v":"Test-CsIM"},"Tests the ability of two users to exchange instant messages.","yes","no","yes","no","no","no","yes","no","no","no","Get-CsAdminRole | ? {$_.Cmdlets –match \"Test-CsIM\"}"]
[null,"Test-CsInterTrunkRouting",{"$f":"IF(ISTEXT(A702),(HYPERLINK(SUBSTITUTE(HLINK(A702),\".aspx\",\"\")&IF(C$1=2013,\"(v=ocs.15).aspx\",\"(v=ocs.14).aspx\"),A702)),\"\")","v":""},{"$f":"IF(ISTEXT(B702),(HYPERLINK(SUBSTITUTE(HLINK(B702),\".aspx\",\"\")&IF(D$1=2013,\"(v=ocs.15).aspx\",\"(v=ocs.14).aspx\"),B702)),\"\")","v":"Test-CsInterTrunkRouting"},"Verifies the route and the PSTN usage used when routing a phone call made from a specified SIP trunk. This cmdlet was introduced in Lync Server 2013.","yes","no","no","no","no","no","yes","no","no","yes","Get-CsAdminRole | ? {$_.Cmdlets –match \"Test-CsInterTrunkRouting\"}"]
["Test-CsKerberosAccountAssignment","Test-CsKerberosAccountAssignment",{"$f":"IF(ISTEXT(A703),(HYPERLINK(SUBSTITUTE(HLINK(A703),\".aspx\",\"\")&IF(C$1=2013,\"(v=ocs.15).aspx\",\"(v=ocs.14).aspx\"),A703)),\"\")","v":"Test-CsKerberosAccountAssignment"},{"$f":"IF(ISTEXT(B703),(HYPERLINK(SUBSTITUTE(HLINK(B703),\".aspx\",\"\")&IF(D$1=2013,\"(v=ocs.15).aspx\",\"(v=ocs.14).aspx\"),B703)),\"\")","v":"Test-CsKerberosAccountAssignment"},"Verifies the configuration of the Kerberos account assigned to a site.","no","no","no","no","no","no","no","no","no","no","Get-CsAdminRole | ? {$_.Cmdlets –match \"Test-CsKerberosAccountAssignment\"}"]
["Test-CsLisCivicAddress","Test-CsLisCivicAddress",{"$f":"IF(ISTEXT(A704),(HYPERLINK(SUBSTITUTE(HLINK(A704),\".aspx\",\"\")&IF(C$1=2013,\"(v=ocs.15).aspx\",\"(v=ocs.14).aspx\"),A704)),\"\")","v":"Test-CsLisCivicAddress"},{"$f":"IF(ISTEXT(B704),(HYPERLINK(SUBSTITUTE(HLINK(B704),\".aspx\",\"\")&IF(D$1=2013,\"(v=ocs.15).aspx\",\"(v=ocs.14).aspx\"),B704)),\"\")","v":"Test-CsLisCivicAddress"},"Tests one or more civic addresses against the Master Street Address Guide.","yes","no","no","yes","no","no","yes","no","no","yes","Get-CsAdminRole | ? {$_.Cmdlets –match \"Test-CsLisCivicAddress\"}"]
["Test-CsLisConfiguration","Test-CsLisConfiguration",{"$f":"IF(ISTEXT(A705),(HYPERLINK(SUBSTITUTE(HLINK(A705),\".aspx\",\"\")&IF(C$1=2013,\"(v=ocs.15).aspx\",\"(v=ocs.14).aspx\"),A705)),\"\")","v":"Test-CsLisConfiguration"},{"$f":"IF(ISTEXT(B705),(HYPERLINK(SUBSTITUTE(HLINK(B705),\".aspx\",\"\")&IF(D$1=2013,\"(v=ocs.15).aspx\",\"(v=ocs.14).aspx\"),B705)),\"\")","v":"Test-CsLisConfiguration"},"Tests the Location Information Server (LIS) configuration.","yes","no","no","yes","no","no","yes","no","no","yes","Get-CsAdminRole | ? {$_.Cmdlets –match \"Test-CsLisConfiguration\"}"]
["Test-CsLocationPolicy","Test-CsLocationPolicy",{"$f":"IF(ISTEXT(A706),(HYPERLINK(SUBSTITUTE(HLINK(A706),\".aspx\",\"\")&IF(C$1=2013,\"(v=ocs.15).aspx\",\"(v=ocs.14).aspx\"),A706)),\"\")","v":"Test-CsLocationPolicy"},{"$f":"IF(ISTEXT(B706),(HYPERLINK(SUBSTITUTE(HLINK(B706),\".aspx\",\"\")&IF(D$1=2013,\"(v=ocs.15).aspx\",\"(v=ocs.14).aspx\"),B706)),\"\")","v":"Test-CsLocationPolicy"},"Runs a test to determine the location policy that will be used based on the criteria specified in the parameter values. The location policy contains the settings that will determine whether and how Enhanced 9-1-1 (E9-1-1) will be applied. E9-1-1 enables those who answer 911 emergency calls to determine the caller's geographic location.","yes","no","no","yes","no","no","yes","no","no","yes","Get-CsAdminRole | ? {$_.Cmdlets –match \"Test-CsLocationPolicy\"}"]
["Test-CsMcxConference","Test-CsMcxConference",{"$f":"IF(ISTEXT(A707),(HYPERLINK(SUBSTITUTE(HLINK(A707),\".aspx\",\"\")&IF(C$1=2013,\"(v=ocs.15).aspx\",\"(v=ocs.14).aspx\"),A707)),\"\")","v":"Test-CsMcxConference"},{"$f":"IF(ISTEXT(B707),(HYPERLINK(SUBSTITUTE(HLINK(B707),\".aspx\",\"\")&IF(D$1=2013,\"(v=ocs.15).aspx\",\"(v=ocs.14).aspx\"),B707)),\"\")","v":"Test-CsMcxConference"},"Tests the ability of three users to participate in a Lync Server 2013 Mobility Service conference. The Mobility Service enables users of mobile phones such as iPhones and Windows Phones to do such things as exchange instant messages and presence information; store and retrieve voice mail internally instead of with their wireless provider; and take advantage of Lync Server capabilities such as Call via Work and dial-out conferencing. This cmdlet was introduced in the cumulative update for Lync Server 2010: November 2011.","yes","no","yes","no","no","no","yes","no","no","no","Get-CsAdminRole | ? {$_.Cmdlets –match \"Test-CsMcxConference\"}"]
["Test-CsMcxP2PIM","Test-CsMcxP2PIM",{"$f":"IF(ISTEXT(A708),(HYPERLINK(SUBSTITUTE(HLINK(A708),\".aspx\",\"\")&IF(C$1=2013,\"(v=ocs.15).aspx\",\"(v=ocs.14).aspx\"),A708)),\"\")","v":"Test-CsMcxP2PIM"},{"$f":"IF(ISTEXT(B708),(HYPERLINK(SUBSTITUTE(HLINK(B708),\".aspx\",\"\")&IF(D$1=2013,\"(v=ocs.15).aspx\",\"(v=ocs.14).aspx\"),B708)),\"\")","v":"Test-CsMcxP2PIM"},"Tests the ability of a pair of users to exchange instant messages by using the Lync Server Mobility Service. The Mobility Service enables users of mobile phones such as iPhones and Windows Phones to do such things as exchange instant messages and presence information; store and retrieve voice mail internally instead of with their wireless provider; and take advantage of Lync Server capabilities such as Call via Work and dial-out conferencing. This cmdlet was introduced in the cumulative update for Lync Server 2010: November 2011.","yes","no","yes","no","no","no","yes","no","no","no","Get-CsAdminRole | ? {$_.Cmdlets –match \"Test-CsMcxP2PIM\"}"]
["Test-CsMcxPushNotification","Test-CsMcxPushNotification",{"$f":"IF(ISTEXT(A709),(HYPERLINK(SUBSTITUTE(HLINK(A709),\".aspx\",\"\")&IF(C$1=2013,\"(v=ocs.15).aspx\",\"(v=ocs.14).aspx\"),A709)),\"\")","v":"Test-CsMcxPushNotification"},{"$f":"IF(ISTEXT(B709),(HYPERLINK(SUBSTITUTE(HLINK(B709),\".aspx\",\"\")&IF(D$1=2013,\"(v=ocs.15).aspx\",\"(v=ocs.14).aspx\"),B709)),\"\")","v":"Test-CsMcxPushNotification"},"Verifies that the push notification service is working. The push notification service (Apple Push Notification Service and Microsoft Push Notification Service) provides a way to send notifications about events such as new instant messages or new voice mail to mobile devices like iPhones and Windows Phones, even if the Lync application on those devices is currently suspended or running in the background. This cmdlet was introduced in the cumulative update for Lync Server 2010: November 2011.","yes","no","yes","no","no","no","yes","no","no","no","Get-CsAdminRole | ? {$_.Cmdlets –match \"Test-CsMcxPushNotification\"}"]
["Test-CsOUPermission","Test-CsOUPermission",{"$f":"IF(ISTEXT(A710),(HYPERLINK(SUBSTITUTE(HLINK(A710),\".aspx\",\"\")&IF(C$1=2013,\"(v=ocs.15).aspx\",\"(v=ocs.14).aspx\"),A710)),\"\")","v":"Test-CsOUPermission"},{"$f":"IF(ISTEXT(B710),(HYPERLINK(SUBSTITUTE(HLINK(B710),\".aspx\",\"\")&IF(D$1=2013,\"(v=ocs.15).aspx\",\"(v=ocs.14).aspx\"),B710)),\"\")","v":"Test-CsOUPermission"},"Verifies that the required permissions needed to manage users, computers, and other objects have been set on the specified Active Directory container.","no","no","no","no","no","no","no","no","no","no","Get-CsAdminRole | ? {$_.Cmdlets –match \"Test-CsOUPermission\"}"]
["Test-CsP2PAV","Test-CsP2PAV",{"$f":"IF(ISTEXT(A711),(HYPERLINK(SUBSTITUTE(HLINK(A711),\".aspx\",\"\")&IF(C$1=2013,\"(v=ocs.15).aspx\",\"(v=ocs.14).aspx\"),A711)),\"\")","v":"Test-CsP2PAV"},{"$f":"IF(ISTEXT(B711),(HYPERLINK(SUBSTITUTE(HLINK(B711),\".aspx\",\"\")&IF(D$1=2013,\"(v=ocs.15).aspx\",\"(v=ocs.14).aspx\"),B711)),\"\")","v":"Test-CsP2PAV"},"Tests the ability of a pair of users to conduct a peer-to-peer audio/video (A/V) call.","yes","no","yes","no","no","no","yes","no","no","yes","Get-CsAdminRole | ? {$_.Cmdlets –match \"Test-CsP2PAV\"}"]
[null,"Test-CsPersistentChatMessage",{"$f":"IF(ISTEXT(A712),(HYPERLINK(SUBSTITUTE(HLINK(A712),\".aspx\",\"\")&IF(C$1=2013,\"(v=ocs.15).aspx\",\"(v=ocs.14).aspx\"),A712)),\"\")","v":""},{"$f":"IF(ISTEXT(B712),(HYPERLINK(SUBSTITUTE(HLINK(B712),\".aspx\",\"\")&IF(D$1=2013,\"(v=ocs.15).aspx\",\"(v=ocs.14).aspx\"),B712)),\"\")","v":"Test-CsPersistentChatMessage"},"Verifies whether or not a pair of users can exchange messages using the Persistent Chat service (formerly known as the Persistent Chat service). This cmdlet was introduced in Lync Server 2013.","yes","no","yes","no","yes","no","yes","no","no","no","Get-CsAdminRole | ? {$_.Cmdlets –match \"Test-CsPersistentChatMessage\"}"]
["Test-CsPhoneBootstrap","Test-CsPhoneBootstrap",{"$f":"IF(ISTEXT(A713),(HYPERLINK(SUBSTITUTE(HLINK(A713),\".aspx\",\"\")&IF(C$1=2013,\"(v=ocs.15).aspx\",\"(v=ocs.14).aspx\"),A713)),\"\")","v":"Test-CsPhoneBootstrap"},{"$f":"IF(ISTEXT(B713),(HYPERLINK(SUBSTITUTE(HLINK(B713),\".aspx\",\"\")&IF(D$1=2013,\"(v=ocs.15).aspx\",\"(v=ocs.14).aspx\"),B713)),\"\")","v":"Test-CsPhoneBootstrap"},"Verifies that a user can log on to Microsoft Lync Server 2010 using a Microsoft Lync 2010 Phone Edition-compatible device.","yes","no","yes","no","no","no","yes","no","no","yes","Get-CsAdminRole | ? {$_.Cmdlets –match \"Test-CsPhoneBootstrap\"}"]
["Test-CsPresence","Test-CsPresence",{"$f":"IF(ISTEXT(A714),(HYPERLINK(SUBSTITUTE(HLINK(A714),\".aspx\",\"\")&IF(C$1=2013,\"(v=ocs.15).aspx\",\"(v=ocs.14).aspx\"),A714)),\"\")","v":"Test-CsPresence"},{"$f":"IF(ISTEXT(B714),(HYPERLINK(SUBSTITUTE(HLINK(B714),\".aspx\",\"\")&IF(D$1=2013,\"(v=ocs.15).aspx\",\"(v=ocs.14).aspx\"),B714)),\"\")","v":"Test-CsPresence"},"Tests the ability of a user to log on to Microsoft Lync Server 2010, publish his or her presence information, and then subscribe to the presence information published by a second user.","yes","no","yes","no","no","no","yes","no","no","no","Get-CsAdminRole | ? {$_.Cmdlets –match \"Test-CsPresence\"}"]
["Test-CsPstnOutboundCall","Test-CsPstnOutboundCall",{"$f":"IF(ISTEXT(A715),(HYPERLINK(SUBSTITUTE(HLINK(A715),\".aspx\",\"\")&IF(C$1=2013,\"(v=ocs.15).aspx\",\"(v=ocs.14).aspx\"),A715)),\"\")","v":"Test-CsPstnOutboundCall"},{"$f":"IF(ISTEXT(B715),(HYPERLINK(SUBSTITUTE(HLINK(B715),\".aspx\",\"\")&IF(D$1=2013,\"(v=ocs.15).aspx\",\"(v=ocs.14).aspx\"),B715)),\"\")","v":"Test-CsPstnOutboundCall"},"Tests the ability of a user to make a call to a phone number located on the public switched telephone network (PSTN).","yes","no","yes","no","no","no","yes","no","no","yes","Get-CsAdminRole | ? {$_.Cmdlets –match \"Test-CsPstnOutboundCall\"}"]
["Test-CsPstnPeerToPeerCall","Test-CsPstnPeerToPeerCall",{"$f":"IF(ISTEXT(A716),(HYPERLINK(SUBSTITUTE(HLINK(A716),\".aspx\",\"\")&IF(C$1=2013,\"(v=ocs.15).aspx\",\"(v=ocs.14).aspx\"),A716)),\"\")","v":"Test-CsPstnPeerToPeerCall"},{"$f":"IF(ISTEXT(B716),(HYPERLINK(SUBSTITUTE(HLINK(B716),\".aspx\",\"\")&IF(D$1=2013,\"(v=ocs.15).aspx\",\"(v=ocs.14).aspx\"),B716)),\"\")","v":"Test-CsPstnPeerToPeerCall"},"Tests the ability a pair of users to conduct a peer-to-peer call over the public switched telephone network (PSTN) gateway.","yes","no","yes","no","no","no","yes","no","no","yes","Get-CsAdminRole | ? {$_.Cmdlets –match \"Test-CsPstnPeerToPeerCall\"}"]
["Test-CsRegistration","Test-CsRegistration",{"$f":"IF(ISTEXT(A717),(HYPERLINK(SUBSTITUTE(HLINK(A717),\".aspx\",\"\")&IF(C$1=2013,\"(v=ocs.15).aspx\",\"(v=ocs.14).aspx\"),A717)),\"\")","v":"Test-CsRegistration"},{"$f":"IF(ISTEXT(B717),(HYPERLINK(SUBSTITUTE(HLINK(B717),\".aspx\",\"\")&IF(D$1=2013,\"(v=ocs.15).aspx\",\"(v=ocs.14).aspx\"),B717)),\"\")","v":"Test-CsRegistration"},"Tests the ability of a user to log on to Microsoft Lync Server 2010. Test-CsRegistration is a \"synthetic transaction\": a simulation of common Lync Server 2010 activities used for health and performance monitoring.","yes","no","yes","no","no","no","yes","no","no","no","Get-CsAdminRole | ? {$_.Cmdlets –match \"Test-CsRegistration\"}"]
[null,"Test-CsReplica",{"$f":"IF(ISTEXT(A718),(HYPERLINK(SUBSTITUTE(HLINK(A718),\".aspx\",\"\")&IF(C$1=2013,\"(v=ocs.15).aspx\",\"(v=ocs.14).aspx\"),A718)),\"\")","v":""},{"$f":"IF(ISTEXT(B718),(HYPERLINK(SUBSTITUTE(HLINK(B718),\".aspx\",\"\")&IF(D$1=2013,\"(v=ocs.15).aspx\",\"(v=ocs.14).aspx\"),B718)),\"\")","v":"Test-CsReplica"},"Verifies the status of the replica service on the local computer. The replica service is used to replicate information among all the Lync Server 2013 computers in your topology. This cmdlet was introduced in Lync Server 2013.","no","no","no","no","no","no","no","no","no","no","Get-CsAdminRole | ? {$_.Cmdlets –match \"Test-CsReplica\"}"]
["Test-CsSetupPermission","Test-CsSetupPermission",{"$f":"IF(ISTEXT(A719),(HYPERLINK(SUBSTITUTE(HLINK(A719),\".aspx\",\"\")&IF(C$1=2013,\"(v=ocs.15).aspx\",\"(v=ocs.14).aspx\"),A719)),\"\")","v":"Test-CsSetupPermission"},{"$f":"IF(ISTEXT(B719),(HYPERLINK(SUBSTITUTE(HLINK(B719),\".aspx\",\"\")&IF(D$1=2013,\"(v=ocs.15).aspx\",\"(v=ocs.14).aspx\"),B719)),\"\")","v":"Test-CsSetupPermission"},"Verifies that the required permissions needed to install Microsoft Lync Server 2010 or one of its components have been configured on the specified Active Directory container.","no","no","no","no","no","no","no","no","no","no","Get-CsAdminRole | ? {$_.Cmdlets –match \"Test-CsSetupPermission\"}"]
["Test-CsTopology","Test-CsTopology",{"$f":"IF(ISTEXT(A720),(HYPERLINK(SUBSTITUTE(HLINK(A720),\".aspx\",\"\")&IF(C$1=2013,\"(v=ocs.15).aspx\",\"(v=ocs.14).aspx\"),A720)),\"\")","v":"Test-CsTopology"},{"$f":"IF(ISTEXT(B720),(HYPERLINK(SUBSTITUTE(HLINK(B720),\".aspx\",\"\")&IF(D$1=2013,\"(v=ocs.15).aspx\",\"(v=ocs.14).aspx\"),B720)),\"\")","v":"Test-CsTopology"},"Verifies service activation and group permissions for your installation of Microsoft Lync Server 2010.","no","no","no","no","no","no","no","no","no","no","Get-CsAdminRole | ? {$_.Cmdlets –match \"Test-CsTopology\"}"]
["Test-CsTrunkConfiguration","Test-CsTrunkConfiguration",{"$f":"IF(ISTEXT(A721),(HYPERLINK(SUBSTITUTE(HLINK(A721),\".aspx\",\"\")&IF(C$1=2013,\"(v=ocs.15).aspx\",\"(v=ocs.14).aspx\"),A721)),\"\")","v":"Test-CsTrunkConfiguration"},{"$f":"IF(ISTEXT(B721),(HYPERLINK(SUBSTITUTE(HLINK(B721),\".aspx\",\"\")&IF(D$1=2013,\"(v=ocs.15).aspx\",\"(v=ocs.14).aspx\"),B721)),\"\")","v":"Test-CsTrunkConfiguration"},"Validates a trunk configuration against a phone number.","yes","no","yes","no","no","no","yes","no","no","yes","Get-CsAdminRole | ? {$_.Cmdlets –match \"Test-CsTrunkConfiguration\"}"]
[null,"Test-CsUcwaConference",{"$f":"IF(ISTEXT(A722),(HYPERLINK(SUBSTITUTE(HLINK(A722),\".aspx\",\"\")&IF(C$1=2013,\"(v=ocs.15).aspx\",\"(v=ocs.14).aspx\"),A722)),\"\")","v":""},{"$f":"IF(ISTEXT(B722),(HYPERLINK(SUBSTITUTE(HLINK(B722),\".aspx\",\"\")&IF(D$1=2013,\"(v=ocs.15).aspx\",\"(v=ocs.14).aspx\"),B722)),\"\")","v":"Test-CsUcwaConference"},"Tests the ability of a pair of users to schedule, join, and then conduct an online conference using the Unified Communications Web API (UCWA). This cmdlet was introduced in Lync Server 2013.","yes","no","no","no","no","no","yes","no","no","no",{"$f":"\"Get-CsAdminRole | ? {$_.Cmdlets –match \"& CHAR(34) &B722& CHAR(34) &\"}\"","v":"Get-CsAdminRole | ? {$_.Cmdlets –match \"Test-CsUcwaConference\"}"}]
[null,"Test-CsUnifiedContactStore",{"$f":"IF(ISTEXT(A723),(HYPERLINK(SUBSTITUTE(HLINK(A723),\".aspx\",\"\")&IF(C$1=2013,\"(v=ocs.15).aspx\",\"(v=ocs.14).aspx\"),A723)),\"\")","v":""},{"$f":"IF(ISTEXT(B723),(HYPERLINK(SUBSTITUTE(HLINK(B723),\".aspx\",\"\")&IF(D$1=2013,\"(v=ocs.15).aspx\",\"(v=ocs.14).aspx\"),B723)),\"\")","v":"Test-CsUnifiedContactStore"},"Verifies whether or not a user's contacts can be accessed through the Unified Contact Store. The Unified Contact Store provides a way for users to maintain a single set of contacts that can be accessed using Lync 2013, Outlook, and/or Outlook Web Access.","yes","no","no","no","no","no","yes","no","no","no",{"$f":"\"Get-CsAdminRole | ? {$_.Cmdlets –match \"& CHAR(34) &B723& CHAR(34) &\"}\"","v":"Get-CsAdminRole | ? {$_.Cmdlets –match \"Test-CsUnifiedContactStore\"}"}]
["Test-CsVoiceNormalizationRule","Test-CsVoiceNormalizationRule",{"$f":"IF(ISTEXT(A724),(HYPERLINK(SUBSTITUTE(HLINK(A724),\".aspx\",\"\")&IF(C$1=2013,\"(v=ocs.15).aspx\",\"(v=ocs.14).aspx\"),A724)),\"\")","v":"Test-CsVoiceNormalizationRule"},{"$f":"IF(ISTEXT(B724),(HYPERLINK(SUBSTITUTE(HLINK(B724),\".aspx\",\"\")&IF(D$1=2013,\"(v=ocs.15).aspx\",\"(v=ocs.14).aspx\"),B724)),\"\")","v":"Test-CsVoiceNormalizationRule"},"Tests a telephone number against a voice normalization rule and returns the number after the normalization rule has been applied. Voice normalization rules are used to convert a telephone dialing requirement (for example, you must dial 9 to access an outside line) to the E.164 phone number format used by Microsoft Lync Server 2010.","yes","no","no","no","no","no","yes","no","no","yes",{"$f":"\"Get-CsAdminRole | ? {$_.Cmdlets –match \"& CHAR(34) &B724& CHAR(34) &\"}\"","v":"Get-CsAdminRole | ? {$_.Cmdlets –match \"Test-CsVoiceNormalizationRule\"}"}]
["Test-CsVoicePolicy","Test-CsVoicePolicy",{"$f":"IF(ISTEXT(A725),(HYPERLINK(SUBSTITUTE(HLINK(A725),\".aspx\",\"\")&IF(C$1=2013,\"(v=ocs.15).aspx\",\"(v=ocs.14).aspx\"),A725)),\"\")","v":"Test-CsVoicePolicy"},{"$f":"IF(ISTEXT(B725),(HYPERLINK(SUBSTITUTE(HLINK(B725),\".aspx\",\"\")&IF(D$1=2013,\"(v=ocs.15).aspx\",\"(v=ocs.14).aspx\"),B725)),\"\")","v":"Test-CsVoicePolicy"},"Tests a telephone number against a voice policy and determines which voice route would be used against that policy for that number.","yes","no","no","no","no","no","yes","no","no","yes",{"$f":"\"Get-CsAdminRole | ? {$_.Cmdlets –match \"& CHAR(34) &B725& CHAR(34) &\"}\"","v":"Get-CsAdminRole | ? {$_.Cmdlets –match \"Test-CsVoicePolicy\"}"}]
["Test-CsVoiceRoute","Test-CsVoiceRoute",{"$f":"IF(ISTEXT(A726),(HYPERLINK(SUBSTITUTE(HLINK(A726),\".aspx\",\"\")&IF(C$1=2013,\"(v=ocs.15).aspx\",\"(v=ocs.14).aspx\"),A726)),\"\")","v":"Test-CsVoiceRoute"},{"$f":"IF(ISTEXT(B726),(HYPERLINK(SUBSTITUTE(HLINK(B726),\".aspx\",\"\")&IF(D$1=2013,\"(v=ocs.15).aspx\",\"(v=ocs.14).aspx\"),B726)),\"\")","v":"Test-CsVoiceRoute"},"Tests a telephone number against a voice route number pattern and returns a Boolean (true/false) value stating whether the supplied number matches the number pattern for the route. Number pattern is just one of the properties used by voice routes to tell Microsoft Lync Server 2010 how to route calls from Enterprise Voice users to phone numbers on the public switched telephone network (PSTN) or a private branch exchange (PBX).","yes","no","no","no","no","no","yes","no","no","yes",{"$f":"\"Get-CsAdminRole | ? {$_.Cmdlets –match \"& CHAR(34) &B726& CHAR(34) &\"}\"","v":"Get-CsAdminRole | ? {$_.Cmdlets –match \"Test-CsVoiceRoute\"}"}]
["Test-CsVoiceTestConfiguration","Test-CsVoiceTestConfiguration",{"$f":"IF(ISTEXT(A727),(HYPERLINK(SUBSTITUTE(HLINK(A727),\".aspx\",\"\")&IF(C$1=2013,\"(v=ocs.15).aspx\",\"(v=ocs.14).aspx\"),A727)),\"\")","v":"Test-CsVoiceTestConfiguration"},{"$f":"IF(ISTEXT(B727),(HYPERLINK(SUBSTITUTE(HLINK(B727),\".aspx\",\"\")&IF(D$1=2013,\"(v=ocs.15).aspx\",\"(v=ocs.14).aspx\"),B727)),\"\")","v":"Test-CsVoiceTestConfiguration"},"Runs test voice configurations to ensure voice routing and policies work as expected.","yes","no","no","no","no","no","yes","no","no","yes","Get-CsAdminRole | ? {$_.Cmdlets –match \"Test-CsVoiceTestConfiguration\"}"]
["Test-CsVoiceUser","Test-CsVoiceUser",{"$f":"IF(ISTEXT(A728),(HYPERLINK(SUBSTITUTE(HLINK(A728),\".aspx\",\"\")&IF(C$1=2013,\"(v=ocs.15).aspx\",\"(v=ocs.14).aspx\"),A728)),\"\")","v":"Test-CsVoiceUser"},{"$f":"IF(ISTEXT(B728),(HYPERLINK(SUBSTITUTE(HLINK(B728),\".aspx\",\"\")&IF(D$1=2013,\"(v=ocs.15).aspx\",\"(v=ocs.14).aspx\"),B728)),\"\")","v":"Test-CsVoiceUser"},"Identifies the route that a phone call from a given user would take to be completed based on voice rules, routes, and policies.","yes","no","yes","no","no","no","yes","no","no","yes","Get-CsAdminRole | ? {$_.Cmdlets –match \"Test-CsVoiceUser\"}"]
[null,"Test-CsWatcherNodeConfiguration",{"$f":"IF(ISTEXT(A729),(HYPERLINK(SUBSTITUTE(HLINK(A729),\".aspx\",\"\")&IF(C$1=2013,\"(v=ocs.15).aspx\",\"(v=ocs.14).aspx\"),A729)),\"\")","v":""},{"$f":"IF(ISTEXT(B729),(HYPERLINK(SUBSTITUTE(HLINK(B729),\".aspx\",\"\")&IF(D$1=2013,\"(v=ocs.15).aspx\",\"(v=ocs.14).aspx\"),B729)),\"\")","v":"Test-CsWatcherNodeConfiguration"},"Verifies the watcher node configuration settings in use in your organization. Watcher nodes are computers that periodically use Microsoft System Center Operations Manager and Lync Server 2013 synthetic transactions to verify that Lync Server components are working as expected. This cmdlet was introduced in Lync Server 2013.","no","no","no","no","no","no","no","no","no","no","Get-CsAdminRole | ? {$_.Cmdlets –match \"Test-CsWatcherNodeConfiguration\"}"]
["Test-CsWebApp","Test-CsWebApp",{"$f":"IF(ISTEXT(A730),(HYPERLINK(SUBSTITUTE(HLINK(A730),\".aspx\",\"\")&IF(C$1=2013,\"(v=ocs.15).aspx\",\"(v=ocs.14).aspx\"),A730)),\"\")","v":"Test-CsWebApp"},{"$f":"IF(ISTEXT(B730),(HYPERLINK(SUBSTITUTE(HLINK(B730),\".aspx\",\"\")&IF(D$1=2013,\"(v=ocs.15).aspx\",\"(v=ocs.14).aspx\"),B730)),\"\")","v":"Test-CsWebApp"},"This cmdlet does not currently work with Microsoft Lync Server 2010.","yes","no","no","no","no","no","no","no","no","no","Get-CsAdminRole | ? {$_.Cmdlets –match \"Test-CsWebApp\"}"]
["Test-CsWebAppAnonymous","Test-CsWebAppAnonymous",{"$f":"IF(ISTEXT(A731),(HYPERLINK(SUBSTITUTE(HLINK(A731),\".aspx\",\"\")&IF(C$1=2013,\"(v=ocs.15).aspx\",\"(v=ocs.14).aspx\"),A731)),\"\")","v":"Test-CsWebAppAnonymous"},{"$f":"IF(ISTEXT(B731),(HYPERLINK(SUBSTITUTE(HLINK(B731),\".aspx\",\"\")&IF(D$1=2013,\"(v=ocs.15).aspx\",\"(v=ocs.14).aspx\"),B731)),\"\")","v":"Test-CsWebAppAnonymous"},"This cmdlet does not currently work with Microsoft Lync Server 2010.","yes","no","no","no","no","no","no","no","no","no","Get-CsAdminRole | ? {$_.Cmdlets –match \"Test-CsWebAppAnonymous\"}"]
[null,"Test-CsWebScheduler",{"$f":"IF(ISTEXT(A732),(HYPERLINK(SUBSTITUTE(HLINK(A732),\".aspx\",\"\")&IF(C$1=2013,\"(v=ocs.15).aspx\",\"(v=ocs.14).aspx\"),A732)),\"\")","v":""},{"$f":"IF(ISTEXT(B732),(HYPERLINK(SUBSTITUTE(HLINK(B732),\".aspx\",\"\")&IF(D$1=2013,\"(v=ocs.15).aspx\",\"(v=ocs.14).aspx\"),B732)),\"\")","v":"Test-CsWebScheduler"},"Verifies whether or not a user can employ the Lync Server 2013 Web scheduler to schedule an online meeting. This cmdlet was introduced in Lync Server 2013.","yes","no","no","no","no","no","yes","no","no","no","Get-CsAdminRole | ? {$_.Cmdlets –match \"Test-CsWebScheduler\"}"]
[null,"Test-CsXmppIM",{"$f":"IF(ISTEXT(A733),(HYPERLINK(SUBSTITUTE(HLINK(A733),\".aspx\",\"\")&IF(C$1=2013,\"(v=ocs.15).aspx\",\"(v=ocs.14).aspx\"),A733)),\"\")","v":""},{"$f":"IF(ISTEXT(B733),(HYPERLINK(SUBSTITUTE(HLINK(B733),\".aspx\",\"\")&IF(D$1=2013,\"(v=ocs.15).aspx\",\"(v=ocs.14).aspx\"),B733)),\"\")","v":"Test-CsXmppIM"},"Verifies whether or not an instant message can be sent across an XMPP gateway. XMPP gateways enable Lync Server 2013 users to exchange instant message and presence information with users belonging to IM and presence providers that employ the extensible Messaging and Presence Protocol (XMPP). This cmdlet was introduced in Lync Server 2013.","yes","no","yes","no","no","no","yes","no","no","no","Get-CsAdminRole | ? {$_.Cmdlets –match \"Test-CsXmppIM\"}"]
["Uninstall-CsDatabase","Uninstall-CsDatabase",{"$f":"IF(ISTEXT(A734),(HYPERLINK(SUBSTITUTE(HLINK(A734),\".aspx\",\"\")&IF(C$1=2013,\"(v=ocs.15).aspx\",\"(v=ocs.14).aspx\"),A734)),\"\")","v":"Uninstall-CsDatabase"},{"$f":"IF(ISTEXT(B734),(HYPERLINK(SUBSTITUTE(HLINK(B734),\".aspx\",\"\")&IF(D$1=2013,\"(v=ocs.15).aspx\",\"(v=ocs.14).aspx\"),B734)),\"\")","v":"Uninstall-CsDatabase"},"Deletes the specified Microsoft Lync Server 2010 database.","no","no","no","no","no","no","no","no","no","no","Get-CsAdminRole | ? {$_.Cmdlets –match \"Uninstall-CsDatabase\"}"]
[null,"Uninstall-CsMirrorDatabase",{"$f":"IF(ISTEXT(A735),(HYPERLINK(SUBSTITUTE(HLINK(A735),\".aspx\",\"\")&IF(C$1=2013,\"(v=ocs.15).aspx\",\"(v=ocs.14).aspx\"),A735)),\"\")","v":""},{"$f":"IF(ISTEXT(B735),(HYPERLINK(SUBSTITUTE(HLINK(B735),\".aspx\",\"\")&IF(D$1=2013,\"(v=ocs.15).aspx\",\"(v=ocs.14).aspx\"),B735)),\"\")","v":"Uninstall-CsMirrorDatabase"},"Uninstalls a Lync Server 2013 Management Shell mirror database. A database mirror enables you to simultaneously maintain two copies of a database, each copy residing on a different server. This cmdlet was introduced in Lync Server 2013.","no","no","no","no","no","no","no","no","no","no","Get-CsAdminRole | ? {$_.Cmdlets –match \"Uninstall-CsMirrorDatabase\"}"]
["Unlock-CsClientPin","Unlock-CsClientPin",{"$f":"IF(ISTEXT(A736),(HYPERLINK(SUBSTITUTE(HLINK(A736),\".aspx\",\"\")&IF(C$1=2013,\"(v=ocs.15).aspx\",\"(v=ocs.14).aspx\"),A736)),\"\")","v":"Unlock-CsClientPin"},{"$f":"IF(ISTEXT(B736),(HYPERLINK(SUBSTITUTE(HLINK(B736),\".aspx\",\"\")&IF(D$1=2013,\"(v=ocs.15).aspx\",\"(v=ocs.14).aspx\"),B736)),\"\")","v":"Unlock-CsClientPin"},"Enables an administrator to unlock the personal identification number (PIN) for a specified user.","yes","no","yes","no","no","no","no","yes","no","yes","Get-CsAdminRole | ? {$_.Cmdlets –match \"Unlock-CsClientPin\"}"]
["Unpublish-CsLisConfiguration","Unpublish-CsLisConfiguration",{"$f":"IF(ISTEXT(A737),(HYPERLINK(SUBSTITUTE(HLINK(A737),\".aspx\",\"\")&IF(C$1=2013,\"(v=ocs.15).aspx\",\"(v=ocs.14).aspx\"),A737)),\"\")","v":"Unpublish-CsLisConfiguration"},{"$f":"IF(ISTEXT(B737),(HYPERLINK(SUBSTITUTE(HLINK(B737),\".aspx\",\"\")&IF(D$1=2013,\"(v=ocs.15).aspx\",\"(v=ocs.14).aspx\"),B737)),\"\")","v":"Unpublish-CsLisConfiguration"},"Removes the Location Information Server (LIS) configuration from the Central Management store.","yes","no","no","yes","no","no","yes","no","no","yes","Get-CsAdminRole | ? {$_.Cmdlets –match \"Unpublish-CsLisConfiguration\"}"]
["Update-CsAddressBook","Update-CsAddressBook",{"$f":"IF(ISTEXT(A738),(HYPERLINK(SUBSTITUTE(HLINK(A738),\".aspx\",\"\")&IF(C$1=2013,\"(v=ocs.15).aspx\",\"(v=ocs.14).aspx\"),A738)),\"\")","v":"Update-CsAddressBook"},{"$f":"IF(ISTEXT(B738),(HYPERLINK(SUBSTITUTE(HLINK(B738),\".aspx\",\"\")&IF(D$1=2013,\"(v=ocs.15).aspx\",\"(v=ocs.14).aspx\"),B738)),\"\")","v":"Update-CsAddressBook"},"Forces the specified Address Book servers to synchronize their contents with the User database.","yes","no","no","no","no","no","yes","no","no","no","Get-CsAdminRole | ? {$_.Cmdlets –match \"Update-CsAddressBook\"}"]
[null,"Update-CsAdminRole",{"$f":"IF(ISTEXT(A739),(HYPERLINK(SUBSTITUTE(HLINK(A739),\".aspx\",\"\")&IF(C$1=2013,\"(v=ocs.15).aspx\",\"(v=ocs.14).aspx\"),A739)),\"\")","v":""},{"$f":"IF(ISTEXT(B739),(HYPERLINK(SUBSTITUTE(HLINK(B739),\".aspx\",\"\")&IF(D$1=2013,\"(v=ocs.15).aspx\",\"(v=ocs.14).aspx\"),B739)),\"\")","v":"Update-CsAdminRole"},"Updates the role-based access control (RBAC) definitions stored in the Central Management database without affecting any other database tables. This cmdlet was introduced in Lync Server 2013.","no","no","no","no","no","no","no","no","no","no","Get-CsAdminRole | ? {$_.Cmdlets –match \"Update-CsAdminRole\"}"]
[null,"Update-CsClsLogging",{"$f":"IF(ISTEXT(A740),(HYPERLINK(SUBSTITUTE(HLINK(A740),\".aspx\",\"\")&IF(C$1=2013,\"(v=ocs.15).aspx\",\"(v=ocs.14).aspx\"),A740)),\"\")","v":""},{"$f":"IF(ISTEXT(B740),(HYPERLINK(SUBSTITUTE(HLINK(B740),\".aspx\",\"\")&IF(D$1=2013,\"(v=ocs.15).aspx\",\"(v=ocs.14).aspx\"),B740)),\"\")","v":"Update-CsClsLogging"},"Updates the duration time for all active centralized logging scenarios. Centralized logging provides a way for administrators to simultaneously enable or disable Lync Server 2013 tracing on multiple computers. This cmdlet was introduced in Lync Server 2013.","yes","no","no","no","no","no","yes","no","no","no","Get-CsAdminRole | ? {$_.Cmdlets –match \"Update-CsClsLogging\"}"]
[null,"Update-CsUserData",{"$f":"IF(ISTEXT(A741),(HYPERLINK(SUBSTITUTE(HLINK(A741),\".aspx\",\"\")&IF(C$1=2013,\"(v=ocs.15).aspx\",\"(v=ocs.14).aspx\"),A741)),\"\")","v":""},{"$f":"IF(ISTEXT(B741),(HYPERLINK(SUBSTITUTE(HLINK(B741),\".aspx\",\"\")&IF(D$1=2013,\"(v=ocs.15).aspx\",\"(v=ocs.14).aspx\"),B741)),\"\")","v":"Update-CsUserData"},"Uses previously-exported user information to update Lync Server user data. This cmdlet was introduced in Lync Server 2013.","yes","no","no","no","no","no","yes","yes","no","no",{"$f":"\"Get-CsAdminRole | ? {$_.Cmdlets –match \"& CHAR(34) &B741& CHAR(34) &\"}\"","v":"Get-CsAdminRole | ? {$_.Cmdlets –match \"Update-CsUserData\"}"}]
["Update-CsUserDatabase","Update-CsUserDatabase",{"$f":"IF(ISTEXT(A742),(HYPERLINK(SUBSTITUTE(HLINK(A742),\".aspx\",\"\")&IF(C$1=2013,\"(v=ocs.15).aspx\",\"(v=ocs.14).aspx\"),A742)),\"\")","v":"Update-CsUserDatabase"},{"$f":"IF(ISTEXT(B742),(HYPERLINK(SUBSTITUTE(HLINK(B742),\".aspx\",\"\")&IF(D$1=2013,\"(v=ocs.15).aspx\",\"(v=ocs.14).aspx\"),B742)),\"\")","v":"Update-CsUserDatabase"},"Forces the back-end user database to clear its replication status with Active Directory. This causes the database to re-read all the user-related information stored in Active Directory Domain Services (AD DS).","yes","no","no","no","no","no","yes","no","no","no",{"$f":"\"Get-CsAdminRole | ? {$_.Cmdlets –match \"& CHAR(34) &B742& CHAR(34) &\"}\"","v":"Get-CsAdminRole | ? {$_.Cmdlets –match \"Update-CsUserDatabase\"}"}]

{"sheet":"Sheet2","index":1,"n_rows":0,"n_cols":0,"rows_kept":0,"cut":false,"hidden":false,"merged":[]}

{"sheet":"Sheet3","index":2,"n_rows":0,"n_cols":0,"rows_kept":0,"cut":false,"hidden":false,"merged":[]}